program: Orca
programVersion: 4.2.1
elementType: S O N C C C C C C C C C C C H H H H H H H H H H H H H H H H H H H
charge: 0
multiplicity: 1
keywords: wb97x-d3
keywords: def2-TZVPP
keywords: def2/J RIJCOSX GRIDX6 NOFINALGRIDX
keywords: grid4 nofinalgrid
keywords: scfconv7
keywords: smallprint printgap noloewdin
keywords: NOSOSCF
formula: C11H19NOS
InChI: InChI=1/C11H19NOS/c1-2-3-4-5-6-7-9-12-11(13)8-10-14-12/h8,10H,2-7,9H2,1H3
33 atoms
S  -1.481627 0.60449 1.160804
O  -1.829188 0.166894 -2.563637
N  -1.718595 -0.211804 -0.304239
C  1.972418 -2.137491 -0.169658
C  0.605296 -2.148738 -0.850892
C  2.225915 -0.932157 0.737707
C  -0.562493 -2.357806 0.116197
C  2.21318 0.408865 0.010848
C  -1.846672 -1.6594 -0.310835
C  2.408483 1.617484 0.921891
C  3.75338 1.65649 1.634282
C  -1.685342 0.58819 -1.42252
C  -1.458601 1.963343 -1.000369
C  -1.329124 2.09459 0.328285
H  2.752222 -2.170661 -0.937132
H  2.090888 -3.055462 0.41557
H  0.585246 -2.937253 -1.607599
H  0.477337 -1.217746 -1.408261
H  3.193763 -1.075881 1.226197
H  1.48826 -0.906576 1.547562
H  -0.29757 -2.021975 1.123728
H  -0.779768 -3.423843 0.217559
H  1.263354 0.534741 -0.516673
H  2.987838 0.409128 -0.765207
H  -2.67645 -1.946802 0.338099
H  -2.126696 -1.941234 -1.325602
H  2.295532 2.526709 0.324278
H  1.601894 1.644507 1.661623
H  3.874573 0.828046 2.333992
H  4.581446 1.608663 0.922896
H  3.869858 2.578306 2.207236
H  -1.397181 2.777431 -1.707122
H  -1.153309 2.999609 0.892255
elementType: S O N C H
totalener: -958.86055224 hartree
nucrepener: 1076.13511920 hartree
electener: -2034.99567144 hartree
oneelecener: -3446.62848719 hartree
twoeener: 1411.63281575 hartree
cpcmener: -0.02025872 hartree
kineticenergy: 955.50080283 hartree
xcener: -75.346849130519 hartree
chargesum: -0.0000000
charge: 0.111238 -0.541341 -0.057778 -0.151219 -0.152068 -0.131453 -0.141961 -0.119851 -0.090226 -0.106339 -0.279132 0.290410 -0.254532 -0.064907 0.073763 0.077966 0.093388 0.072080 0.083732 0.061316 0.076831 0.095060 0.044468 0.079389 0.130814 0.103258 0.072903 0.041897 0.079700 0.081133 0.091352 0.157329 0.172783
qa: 0.1112 -0.5413 -0.0578 -0.1512 -0.1521 -0.1315 -0.1420 -0.1199 -0.0902 -0.1063 -0.2791 0.2904 -0.2545 -0.0649 0.0738 0.0780 0.0934 0.0721 0.0837 0.0613 0.0768 0.0951 0.0445 0.0794 0.1308 0.1033 0.0729 0.0419 0.0797 0.0811 0.0914 0.1573 0.1728
va: 2.5465 1.9711 3.0660 3.9315 3.8551 3.8513 3.8572 3.8508 3.8364 3.8627 3.9469 4.2232 3.8855 3.9701 1.0084 1.0058 1.0089 1.0060 1.0113 1.0127 1.0047 1.0161 1.0234 1.0142 1.0008 1.0267 1.0057 1.0188 0.9980 1.0002 1.0042 1.0009 0.9855
dispcorr: -0.016627324 hartree
energy: -958.877179559749
dipole: 21.43888 -21.09846 0.34042 -4.79138 5.03043 0.23905 4.82679 -2.78059 2.04620
magnitude: 2.08805 au
magnitude: 5.30741 debye
