program: Orca
programVersion: 4.2.1
elementType: S O N C C C C C C C C C C C H H H H H H H H H H H H H H H H H H H
charge: 0
multiplicity: 1
keywords: wb97x-d3
keywords: def2-TZVPP
keywords: def2/J RIJCOSX GRIDX6 NOFINALGRIDX
keywords: grid4 nofinalgrid
keywords: scfconv7
keywords: smallprint printgap noloewdin
keywords: NOSOSCF
formula: C11H19NOS
InChI: InChI=1/C11H19NOS/c1-2-3-4-5-6-7-9-12-11(13)8-10-14-12/h8,10H,2-7,9H2,1H3
33 atoms
S  -1.831125 0.485594 1.251832
O  -1.590485 0.49078 -2.505991
N  -1.791933 -0.155857 -0.316119
C  2.169935 -2.084543 -0.394338
C  0.802262 -1.641868 -0.906995
C  2.515493 -1.60393 1.017312
C  -0.368841 -2.17522 -0.092174
C  2.321643 -0.108861 1.260173
C  -1.714875 -1.59454 -0.506371
C  3.123926 0.800339 0.337441
C  2.8707 2.274656 0.615263
C  -1.660606 0.776351 -1.317432
C  -1.62441 2.101361 -0.713907
C  -1.698346 2.074905 0.62513
H  2.930869 -1.732049 -1.096233
H  2.234248 -3.177064 -0.418258
H  0.688103 -1.96446 -1.945881
H  0.770909 -0.549054 -0.932927
H  3.555804 -1.871591 1.228314
H  1.919073 -2.154477 1.75081
H  -0.213755 -1.99034 0.975317
H  -0.431535 -3.261822 -0.199491
H  2.593102 0.112113 2.297654
H  1.258907 0.146022 1.179343
H  -2.524732 -2.067649 0.052089
H  -1.909946 -1.777943 -1.562686
H  4.190991 0.58128 0.446782
H  2.879251 0.591016 -0.707899
H  3.136358 2.541206 1.640492
H  3.450601 2.91567 -0.050711
H  1.816588 2.52681 0.474752
H  -1.537622 3.000061 -1.305647
H  -1.692803 2.914006 1.305632
elementType: S O N C H
totalener: -958.86254735 hartree
nucrepener: 1067.52087436 hartree
electener: -2026.38342171 hartree
oneelecener: -3429.50532399 hartree
twoeener: 1403.12190228 hartree
cpcmener: -0.02028894 hartree
kineticenergy: 955.51079822 hartree
xcener: -75.348112974582 hartree
chargesum: -0.0000000
charge: 0.108617 -0.540960 -0.064856 -0.168970 -0.089646 -0.160470 -0.148491 -0.085096 -0.083368 -0.100819 -0.271785 0.293053 -0.260736 -0.058190 0.081162 0.076350 0.087163 0.047056 0.075978 0.077443 0.075239 0.085187 0.080071 0.017477 0.130065 0.101894 0.063903 0.059754 0.078946 0.092722 0.069278 0.158122 0.173909
qa: 0.1086 -0.5410 -0.0649 -0.1690 -0.0896 -0.1605 -0.1485 -0.0851 -0.0834 -0.1008 -0.2718 0.2931 -0.2607 -0.0582 0.0812 0.0764 0.0872 0.0471 0.0760 0.0774 0.0752 0.0852 0.0801 0.0175 0.1301 0.1019 0.0639 0.0598 0.0789 0.0927 0.0693 0.1581 0.1739
va: 2.5379 1.9706 3.0639 3.9206 3.8195 3.8863 3.8559 3.8607 3.8238 3.8602 3.9454 4.2170 3.8988 3.9636 0.9999 1.0095 1.0147 1.0167 1.0094 1.0033 1.0064 1.0214 1.0116 1.0180 1.0007 1.0280 1.0081 1.0037 1.0021 1.0042 1.0004 1.0003 0.9838
dispcorr: -0.015896702 hartree
energy: -958.878444051857
dipole: 22.12556 -22.04012 0.08544 -5.05262 5.02840 -0.02422 3.04175 -0.97271 2.06904
magnitude: 2.07094 au
magnitude: 5.26392 debye
