program: Orca
programVersion: 4.2.1
elementType: S O N C C C C C C C C C C C H H H H H H H H H H H H H H H H H H H
charge: 0
multiplicity: 1
keywords: wb97x-d3
keywords: def2-TZVPP
keywords: def2/J RIJCOSX GRIDX6 NOFINALGRIDX
keywords: grid4 nofinalgrid
keywords: scfconv7
keywords: smallprint printgap noloewdin
keywords: NOSOSCF
formula: C11H19NOS
InChI: InChI=1/C11H19NOS/c1-2-3-4-5-6-7-9-12-11(13)8-10-14-12/h8,10H,2-7,9H2,1H3
33 atoms
S  -1.744035 0.528573 1.247855
O  -1.755121 0.429909 -2.517799
N  -1.800593 -0.157627 -0.302745
C  2.1825 -2.05101 -0.459032
C  0.798706 -1.587876 -0.908849
C  2.572084 -1.643747 0.96434
C  -0.344078 -2.154683 -0.076976
C  2.389689 -0.163035 1.291026
C  -1.710962 -1.599019 -0.45784
C  3.154713 0.794192 0.384777
C  2.904797 2.251875 0.743937
C  -1.754973 0.747786 -1.335339
C  -1.706339 2.09048 -0.771923
C  -1.688552 2.101787 0.569114
H  2.921565 -1.662046 -1.164665
H  2.245443 -3.140892 -0.539736
H  0.652535 -1.871688 -1.95527
H  0.76548 -0.494688 -0.890735
H  3.617714 -1.923217 1.127869
H  1.996996 -2.230832 1.68648
H  -0.170025 -1.978167 0.988737
H  -0.387168 -3.240876 -0.196522
H  2.703342 0.004816 2.326616
H  1.325016 0.09416 1.265012
H  -2.493321 -2.068386 0.14149
H  -1.940667 -1.811955 -1.501415
H  4.225895 0.576978 0.445065
H  2.872361 0.634742 -0.659598
H  1.845754 2.504404 0.649146
H  3.20171 2.467364 1.772398
H  3.460924 2.928283 0.093045
H  -1.679059 2.972958 -1.392942
H  -1.65461 2.960549 1.223628
elementType: S O N C H
totalener: -958.86262381 hartree
nucrepener: 1065.23075429 hartree
electener: -2024.09337810 hartree
oneelecener: -3424.88697556 hartree
twoeener: 1400.79359745 hartree
cpcmener: -0.02037421 hartree
kineticenergy: 955.50523389 hartree
xcener: -75.347063178313 hartree
chargesum: 0.0000000
charge: 0.108862 -0.542139 -0.067221 -0.170272 -0.088637 -0.160569 -0.149309 -0.091855 -0.086648 -0.101477 -0.271683 0.298077 -0.258457 -0.060686 0.081043 0.076905 0.087291 0.048390 0.076518 0.077657 0.075656 0.085147 0.080596 0.021412 0.130014 0.103140 0.064117 0.059829 0.069323 0.079245 0.092851 0.158456 0.174421
qa: 0.1089 -0.5421 -0.0672 -0.1703 -0.0886 -0.1606 -0.1493 -0.0919 -0.0866 -0.1015 -0.2717 0.2981 -0.2585 -0.0607 0.0810 0.0769 0.0873 0.0484 0.0765 0.0777 0.0757 0.0851 0.0806 0.0214 0.1300 0.1031 0.0641 0.0598 0.0693 0.0792 0.0929 0.1585 0.1744
va: 2.5382 1.9695 3.0652 3.9186 3.8134 3.8857 3.8537 3.8551 3.8257 3.8578 3.9456 4.2144 3.9004 3.9647 1.0000 1.0094 1.0157 1.0164 1.0092 1.0029 1.0046 1.0217 1.0119 1.0234 1.0005 1.0280 1.0082 1.0041 0.9999 1.0020 1.0040 0.9999 0.9836
dispcorr: -0.015750122 hartree
energy: -958.878373934185
dipole: 22.39432 -22.17625 0.21808 -5.10588 5.14406 0.03818 3.27858 -1.22042 2.05815
magnitude: 2.07003 au
magnitude: 5.26159 debye
