program: Orca
programVersion: 4.2.1
elementType: S O N C C C C C C C C C C C H H H H H H H H H H H H H H H H H H H
charge: 0
multiplicity: 1
keywords: wb97x-d3
keywords: def2-TZVPP
keywords: def2/J RIJCOSX GRIDX6 NOFINALGRIDX
keywords: grid4 nofinalgrid
keywords: scfconv7
keywords: smallprint printgap noloewdin
keywords: NOSOSCF
formula: C11H19NOS
InChI: InChI=1/C11H19NOS/c1-2-3-4-5-6-7-9-12-11(13)8-10-14-12/h8,10H,2-7,9H2,1H3
33 atoms
S  -1.421892 0.487779 1.225358
O  -1.606357 0.424299 -2.535841
N  -1.640512 -0.169593 -0.320708
C  1.887531 -2.357807 -0.127523
C  0.576907 -2.215562 -0.899753
C  2.149911 -1.246041 0.888668
C  -0.671321 -2.43001 -0.039518
C  2.327685 0.136605 0.273094
C  -1.870156 -1.596593 -0.472107
C  2.568511 1.230225 1.305484
C  2.761965 2.600416 0.67401
C  -1.492031 0.725174 -1.354042
C  -1.188588 2.034061 -0.792346
C  -1.120631 2.032018 0.547329
H  2.71854 -2.387857 -0.839217
H  1.89922 -3.324473 0.386582
H  0.565536 -2.931551 -1.725249
H  0.548214 -1.232776 -1.376384
H  3.051118 -1.498964 1.455541
H  1.341427 -1.210415 1.625576
H  -0.459352 -2.222189 1.013766
H  -0.970115 -3.480418 -0.068536
H  1.444666 0.407351 -0.313974
H  3.163479 0.113018 -0.435415
H  -2.758702 -1.876781 0.097204
H  -2.101968 -1.762412 -1.523582
H  1.721423 1.262617 1.998037
H  3.444913 0.979422 1.911666
H  2.9098 3.376073 1.427236
H  3.632627 2.614737 0.014749
H  1.895129 2.886792 0.07429
H  -1.030734 2.902773 -1.413768
H  -0.91412 2.866106 1.202182
elementType: S O N C H
totalener: -958.86211534 hartree
nucrepener: 1082.43046052 hartree
electener: -2041.29257586 hartree
oneelecener: -3459.16984560 hartree
twoeener: 1417.87726974 hartree
cpcmener: -0.02022826 hartree
kineticenergy: 955.51133413 hartree
xcener: -75.348146011208 hartree
chargesum: -0.0000000
charge: 0.112636 -0.541875 -0.057276 -0.145065 -0.152324 -0.120131 -0.144058 -0.124451 -0.090289 -0.104241 -0.273387 0.296018 -0.259071 -0.069365 0.072934 0.079233 0.093832 0.072285 0.080274 0.055977 0.076586 0.095082 0.031721 0.077489 0.130875 0.104245 0.051333 0.070275 0.092503 0.084210 0.071426 0.158071 0.174529
qa: 0.1126 -0.5419 -0.0573 -0.1451 -0.1523 -0.1201 -0.1441 -0.1245 -0.0903 -0.1042 -0.2734 0.2960 -0.2591 -0.0694 0.0729 0.0792 0.0938 0.0723 0.0803 0.0560 0.0766 0.0951 0.0317 0.0775 0.1309 0.1042 0.0513 0.0703 0.0925 0.0842 0.0714 0.1581 0.1745
va: 2.5499 1.9706 3.0686 3.9213 3.8523 3.8608 3.8598 3.8492 3.8353 3.8552 3.9332 4.2151 3.8795 3.9665 1.0090 1.0064 1.0082 1.0064 1.0134 1.0167 1.0039 1.0159 1.0136 1.0152 1.0009 1.0265 1.0126 1.0103 1.0040 1.0017 1.0032 1.0016 0.9834
dispcorr: -0.016991023 hartree
energy: -958.879106362438
dipole: 19.09893 -18.82951 0.26942 -4.45161 4.43044 -0.02117 3.40262 -1.30286 2.09976
magnitude: 2.11708 au
magnitude: 5.38119 debye
