program: Orca
programVersion: 4.2.1
elementType: S O N C C C C C C C C C C C H H H H H H H H H H H H H H H H H H H
charge: 0
multiplicity: 1
keywords: wb97x-d3
keywords: def2-TZVPP
keywords: def2/J RIJCOSX GRIDX6 NOFINALGRIDX
keywords: grid4 nofinalgrid
keywords: scfconv7
keywords: smallprint printgap noloewdin
keywords: NOSOSCF
formula: C11H19NOS
InChI: InChI=1/C11H19NOS/c1-2-3-4-5-6-7-9-12-11(13)8-10-14-12/h8,10H,2-7,9H2,1H3
33 atoms
S  -0.990261 0.982522 0.873573
O  -3.102213 -0.200379 -2.005429
N  -1.741739 -0.115712 -0.170318
C  1.524605 -1.939812 0.501734
C  0.866688 -1.614861 -0.836016
C  3.024164 -1.647481 0.532962
C  -0.555185 -2.145653 -0.982231
C  3.408467 -0.180069 0.36034
C  -1.576685 -1.549246 -0.021504
C  2.96153 0.719454 1.506355
C  3.374627 2.170677 1.308583
C  -2.503623 0.450378 -1.175445
C  -2.43599 1.904088 -1.024505
C  -1.677322 2.297287 0.007035
H  1.375681 -3.002421 0.720347
H  1.026988 -1.400965 1.314483
H  1.472538 -2.048011 -1.638075
H  0.875516 -0.535757 -1.014131
H  3.507848 -2.236285 -0.252734
H  3.438578 -2.012543 1.47795
H  -0.557784 -3.229836 -0.830542
H  -0.908973 -1.979619 -2.001336
H  3.008337 0.205888 -0.582721
H  4.496854 -0.113592 0.265666
H  -1.315005 -1.757292 1.017653
H  -2.552083 -2.005511 -0.195633
H  1.875388 0.670737 1.617079
H  3.37959 0.341471 2.444596
H  3.063218 2.795182 2.146442
H  4.457432 2.26674 1.212649
H  2.92892 2.58669 0.403342
H  -2.960582 2.56754 -1.693893
H  -1.469371 3.306933 0.327323
totalener: -958.84392874 hartree
nucrepener: 1049.52782845 hartree
electener: -2008.37175719 hartree
oneelecener: -3393.18205319 hartree
twoeener: 1384.81029600 hartree
kineticenergy: 955.53507772 hartree
xcener: -75.345874874302 hartree
chargesum: 0.0000000
charge: 0.086040 -0.411452 -0.060154 -0.132936 -0.149485 -0.143499 -0.119465 -0.123769 -0.133824 -0.089278 -0.260474 0.275918 -0.245710 -0.055077 0.078162 0.052866 0.080975 0.071538 0.072256 0.071515 0.069078 0.102388 0.063239 0.073484 0.109445 0.115445 0.041903 0.060727 0.083289 0.077028 0.072468 0.135386 0.131974
qa: 0.0860 -0.4115 -0.0602 -0.1329 -0.1495 -0.1435 -0.1195 -0.1238 -0.1338 -0.0893 -0.2605 0.2759 -0.2457 -0.0551 0.0782 0.0529 0.0810 0.0715 0.0723 0.0715 0.0691 0.1024 0.0632 0.0735 0.1094 0.1154 0.0419 0.0607 0.0833 0.0770 0.0725 0.1354 0.1320
va: 2.5455 2.1149 3.0223 3.8512 3.8681 3.9313 3.8317 3.8648 3.9117 3.8645 3.9486 4.2794 3.9385 3.9881 1.0157 0.9990 1.0137 1.0042 1.0107 1.0102 1.0173 1.0253 1.0071 1.0111 0.9933 1.0201 1.0195 1.0124 1.0048 1.0056 1.0041 1.0069 0.9990
dispcorr: -0.014845001 hartree
energy: -958.858773739081
dipole: 23.84801 -22.97778 0.87024 -5.48548 5.91584 0.43036 4.35270 -3.37891 0.97379
magnitude: 1.37506 au
magnitude: 3.49512 debye
