program: Orca
programVersion: 4.2.1
elementType: S O N C C C C C C C C C C C H H H H H H H H H H H H H H H H H H H
charge: 0
multiplicity: 1
keywords: wb97x-d3
keywords: def2-TZVPP
keywords: def2/J RIJCOSX GRIDX6 NOFINALGRIDX
keywords: grid4 nofinalgrid
keywords: scfconv7
keywords: smallprint printgap noloewdin
keywords: NOSOSCF
formula: C11H19NOS
InChI: InChI=1/C11H19NOS/c1-2-3-4-5-6-7-9-12-11(13)8-10-14-12/h8,10H,2-7,9H2,1H3
33 atoms
S  -1.762918 0.417546 -1.643147
O  -1.858641 0.213509 2.117538
N  -1.861659 -0.309185 -0.116482
C  1.171418 -1.083491 0.198509
C  0.517311 -2.46071 0.139118
C  2.631916 -1.15088 0.631749
C  -0.814719 -2.533411 -0.602294
C  3.252493 0.213629 0.917126
C  -1.973398 -1.748181 0.004098
C  3.271241 1.162446 -0.27593
C  3.969894 2.478157 0.036509
C  -1.809271 0.562812 0.957486
C  -1.670418 1.918947 0.425842
C  -1.634303 1.966163 -0.911636
H  0.633029 -0.444506 0.901184
H  1.096282 -0.601864 -0.781186
H  0.387276 -2.843363 1.156431
H  1.204005 -3.156097 -0.354667
H  3.217601 -1.669035 -0.135752
H  2.708604 -1.766164 1.533884
H  -1.135235 -3.578423 -0.638586
H  -0.670834 -2.238417 -1.647568
H  4.27776 0.070943 1.273203
H  2.711756 0.687156 1.743818
H  -2.056373 -1.949466 1.072648
H  -2.912998 -2.06961 -0.454386
H  3.767404 0.673931 -1.120818
H  2.24896 1.369403 -0.603688
H  5.007434 2.316508 0.333766
H  3.975424 3.146006 -0.825384
H  3.474301 3.002402 0.855393
H  -1.602765 2.776395 1.07665
H  -1.537963 2.840162 -1.537764
totalener: -958.84323378 hartree
nucrepener: 1048.82801809 hartree
electener: -2007.67125186 hartree
oneelecener: -3391.98551236 hartree
twoeener: 1384.31426049 hartree
kineticenergy: 955.53228063 hartree
xcener: -75.344154086921 hartree
chargesum: -0.0000000
charge: 0.091594 -0.404688 -0.059610 -0.112848 -0.108366 -0.132921 -0.150475 -0.125285 -0.109801 -0.073259 -0.263734 0.239418 -0.237656 -0.055625 0.074285 0.053405 0.068570 0.069198 0.058268 0.070184 0.083550 0.066038 0.067385 0.063297 0.107461 0.121565 0.054760 0.046868 0.073891 0.081877 0.074915 0.135520 0.132222
qa: 0.0916 -0.4047 -0.0596 -0.1128 -0.1084 -0.1329 -0.1505 -0.1253 -0.1098 -0.0733 -0.2637 0.2394 -0.2377 -0.0556 0.0743 0.0534 0.0686 0.0692 0.0583 0.0702 0.0835 0.0660 0.0674 0.0633 0.1075 0.1216 0.0548 0.0469 0.0739 0.0819 0.0749 0.1355 0.1322
va: 2.5403 2.1208 3.0434 3.8710 3.8744 3.9348 3.9081 3.8938 3.8522 3.8672 3.9570 4.2965 3.9223 3.9854 1.0161 1.0109 1.0127 1.0079 1.0109 1.0113 1.0152 1.0093 1.0122 1.0105 1.0299 1.0005 1.0074 1.0058 1.0041 1.0052 1.0025 1.0076 0.9983
dispcorr: -0.014563531 hartree
energy: -958.857797306419
dipole: 23.63472 -23.51079 0.12393 -3.30824 3.37748 0.06923 1.83684 -3.18971 -1.35287
magnitude: 1.36029 au
magnitude: 3.45759 debye
