program: Orca
programVersion: 4.2.1
elementType: S O N C C C C C C C C C C C H H H H H H H H H H H H H H H H H H H
charge: 0
multiplicity: 1
keywords: wb97x-d3
keywords: def2-TZVPP
keywords: def2/J RIJCOSX GRIDX6 NOFINALGRIDX
keywords: grid4 nofinalgrid
keywords: scfconv7
keywords: smallprint printgap noloewdin
keywords: NOSOSCF
formula: C11H19NOS
InChI: InChI=1/C11H19NOS/c1-2-3-4-5-6-7-9-12-11(13)8-10-14-12/h8,10H,2-7,9H2,1H3
33 atoms
S  -1.385518 1.095668 0.945651
O  -2.556633 -0.316732 -2.345332
N  -1.824373 -0.088176 -0.183737
C  2.077346 -2.115647 -0.673339
C  0.604533 -1.777796 -0.896551
C  2.787357 -1.251547 0.36869
C  -0.257361 -1.933621 0.349626
C  2.743934 0.242315 0.0649
C  -1.70179 -1.492651 0.145678
C  3.512663 1.102991 1.063882
C  2.902162 1.108564 2.459831
C  -2.228289 0.392132 -1.419217
C  -2.174345 1.854282 -1.367685
C  -1.749407 2.332383 -0.191718
H  2.601972 -2.021927 -1.628875
H  2.168509 -3.16729 -0.383962
H  0.205938 -2.420287 -1.686456
H  0.518146 -0.758883 -1.281342
H  3.832846 -1.570231 0.430785
H  2.365902 -1.446417 1.358836
H  0.172825 -1.375335 1.187206
H  -0.266525 -2.980973 0.666296
H  1.706505 0.591208 0.035022
H  3.146088 0.409145 -0.939725
H  -2.296994 -1.706516 1.037538
H  -2.15883 -2.032444 -0.684056
H  4.552611 0.766142 1.11697
H  3.548346 2.12921 0.688734
H  1.854846 1.416692 2.425764
H  2.938804 0.124545 2.928285
H  3.427726 1.798664 3.120487
H  -2.452866 2.459338 -2.216204
H  -1.621389 3.365605 0.093705
totalener: -958.84403930 hartree
nucrepener: 1051.91402549 hartree
electener: -2010.75806478 hartree
oneelecener: -3398.04078360 hartree
twoeener: 1387.28271882 hartree
kineticenergy: 955.52818771 hartree
xcener: -75.345155701823 hartree
chargesum: 0.0000000
charge: 0.085172 -0.405238 -0.074231 -0.159927 -0.111348 -0.128458 -0.139697 -0.109575 -0.108007 -0.104427 -0.253697 0.252346 -0.228497 -0.057791 0.075752 0.071351 0.090227 0.071784 0.075998 0.059127 0.061555 0.078850 0.040765 0.077124 0.118207 0.108693 0.052884 0.066731 0.062336 0.074685 0.089645 0.135923 0.131740
qa: 0.0852 -0.4052 -0.0742 -0.1599 -0.1113 -0.1285 -0.1397 -0.1096 -0.1080 -0.1044 -0.2537 0.2523 -0.2285 -0.0578 0.0758 0.0714 0.0902 0.0718 0.0760 0.0591 0.0616 0.0788 0.0408 0.0771 0.1182 0.1087 0.0529 0.0667 0.0623 0.0747 0.0896 0.1359 0.1317
va: 2.5300 2.1207 3.0299 3.9219 3.8320 3.8434 3.8548 3.8740 3.8592 3.8997 3.9291 4.2929 3.9159 3.9761 1.0091 1.0097 1.0167 1.0124 1.0128 1.0054 1.0052 1.0212 1.0189 1.0145 1.0005 1.0293 1.0111 1.0071 1.0109 1.0016 1.0077 1.0068 0.9983
dispcorr: -0.015034340 hartree
energy: -958.859073635998
dipole: 23.41976 -22.85897 0.56079 -6.38324 6.92425 0.54101 6.20350 -5.11114 1.09236
magnitude: 1.34180 au
magnitude: 3.41059 debye
