program: Orca
programVersion: 4.2.1
elementType: S O N C C C C C C C C C C C H H H H H H H H H H H H H H H H H H H
charge: 0
multiplicity: 1
keywords: wb97x-d3
keywords: def2-TZVPP
keywords: def2/J RIJCOSX GRIDX6 NOFINALGRIDX
keywords: grid4 nofinalgrid
keywords: scfconv7
keywords: smallprint printgap noloewdin
keywords: NOSOSCF
formula: C11H19NOS
InChI: InChI=1/C11H19NOS/c1-2-3-4-5-6-7-9-12-11(13)8-10-14-12/h8,10H,2-7,9H2,1H3
33 atoms
S  -1.169937 0.778427 0.950724
O  -3.180716 -0.197886 -2.075539
N  -1.881696 -0.243217 -0.1948
C  1.418245 -1.919574 0.433055
C  0.777138 -1.551171 -0.901036
C  2.808163 -1.323659 0.638118
C  -0.601499 -2.162267 -1.125623
C  2.821083 0.193167 0.792291
C  -1.683685 -1.679784 -0.16582
C  4.209175 0.751847 1.077082
C  4.215872 2.265083 1.237547
C  -2.618781 0.391939 -1.177131
C  -2.577649 1.829483 -0.908827
C  -1.853012 2.148425 0.171871
H  1.482202 -3.010351 0.501547
H  0.780185 -1.60673 1.267154
H  1.436494 -1.8843 -1.708117
H  0.711847 -0.465118 -1.007458
H  3.454497 -1.611935 -0.198079
H  3.25674 -1.771265 1.530462
H  -0.5443 -3.251862 -1.036531
H  -0.933748 -1.955419 -2.144582
H  2.142273 0.478316 1.603875
H  2.42277 0.669107 -0.108945
H  -1.465532 -1.973761 0.862339
H  -2.636974 -2.140995 -0.426706
H  4.609145 0.285736 1.982766
H  4.888283 0.466559 0.267928
H  3.860285 2.760458 0.332597
H  3.567897 2.578663 2.057856
H  5.216641 2.643052 1.447354
H  -3.091716 2.537984 -1.538994
H  -1.668496 3.132115 0.5763
totalener: -958.84481256 hartree
nucrepener: 1034.95707661 hartree
electener: -1993.80188917 hartree
oneelecener: -3364.08989023 hartree
twoeener: 1370.28800106 hartree
kineticenergy: 955.53763190 hartree
xcener: -75.345186650206 hartree
chargesum: 0.0000000
charge: 0.085640 -0.411581 -0.061323 -0.126469 -0.153758 -0.121461 -0.115811 -0.094658 -0.141084 -0.090682 -0.253647 0.276229 -0.249055 -0.051653 0.079623 0.051689 0.079933 0.073786 0.058481 0.069094 0.068661 0.102130 0.043267 0.055030 0.111159 0.114232 0.052435 0.054790 0.072453 0.069631 0.086149 0.134963 0.131805
qa: 0.0856 -0.4116 -0.0613 -0.1265 -0.1538 -0.1215 -0.1158 -0.0947 -0.1411 -0.0907 -0.2536 0.2762 -0.2491 -0.0517 0.0796 0.0517 0.0799 0.0738 0.0585 0.0691 0.0687 0.1021 0.0433 0.0550 0.1112 0.1142 0.0524 0.0548 0.0725 0.0696 0.0861 0.1350 0.1318
va: 2.5447 2.1152 3.0174 3.8737 3.8828 3.9053 3.8226 3.8681 3.9170 3.9138 3.9476 4.2782 3.9407 3.9878 1.0155 1.0092 1.0151 1.0046 1.0123 1.0116 1.0176 1.0238 1.0120 1.0120 0.9922 1.0200 1.0086 1.0073 1.0038 1.0030 1.0067 1.0072 0.9986
dispcorr: -0.014100294 hartree
energy: -958.858912856729
dipole: 26.09860 -25.22126 0.87734 -4.02056 4.39586 0.37531 3.96319 -2.92727 1.03592
magnitude: 1.40844 au
magnitude: 3.57998 debye
