program: Orca
programVersion: 4.2.1
elementType: S O N C C C C C C C C C C C H H H H H H H H H H H H H H H H H H H
charge: 0
multiplicity: 1
keywords: wb97x-d3
keywords: def2-TZVPP
keywords: def2/J RIJCOSX GRIDX6 NOFINALGRIDX
keywords: grid4 nofinalgrid
keywords: scfconv7
keywords: smallprint printgap noloewdin
keywords: NOSOSCF
formula: C11H19NOS
InChI: InChI=1/C11H19NOS/c1-2-3-4-5-6-7-9-12-11(13)8-10-14-12/h8,10H,2-7,9H2,1H3
33 atoms
S  -1.953859 0.639741 -1.695915
O  -2.254532 0.029744 2.004774
N  -1.951275 -0.232197 -0.245777
C  2.273833 -1.7337 -0.372175
C  0.836119 -1.405632 -0.7685
C  2.711108 -1.188393 0.987258
C  -0.203685 -1.941319 0.206166
C  2.534464 0.31873 1.167161
C  -1.640888 -1.649047 -0.203656
C  3.228733 1.18374 0.117686
C  4.734925 0.972118 0.041067
C  -2.228264 0.506456 0.889615
C  -2.467234 1.889363 0.476977
C  -2.352787 2.077203 -0.844811
H  2.943888 -1.356759 -1.15062
H  2.407178 -2.820173 -0.371435
H  0.644407 -1.819904 -1.764255
H  0.723897 -0.322859 -0.873398
H  3.758989 -1.458029 1.146497
H  2.161713 -1.697778 1.783699
H  -0.045545 -1.537145 1.207966
H  -0.098437 -3.027612 0.294943
H  2.911102 0.592993 2.157463
H  1.468653 0.56631 1.183652
H  -2.332138 -2.10999 0.503243
H  -1.858547 -2.075501 -1.18586
H  2.785818 1.007171 -0.867177
H  3.025074 2.233578 0.345201
H  4.989683 -0.038995 -0.280316
H  5.195074 1.660818 -0.66789
H  5.207113 1.135552 1.011756
H  -2.710788 2.659834 1.191621
H  -2.479229 2.998317 -1.393573
totalener: -958.84298775 hartree
nucrepener: 1042.79983206 hartree
electener: -2001.64281981 hartree
oneelecener: -3379.92678141 hartree
twoeener: 1378.28396160 hartree
kineticenergy: 955.52618802 hartree
xcener: -75.345733264593 hartree
chargesum: -0.0000000
charge: 0.098369 -0.411866 -0.075364 -0.151739 -0.140350 -0.175637 -0.106511 -0.121626 -0.120601 -0.115359 -0.255224 0.261384 -0.242106 -0.055579 0.074853 0.076233 0.080281 0.061458 0.081326 0.083793 0.090895 0.072467 0.077180 0.069535 0.114403 0.104802 0.053385 0.070051 0.068643 0.087416 0.079456 0.134650 0.131382
qa: 0.0984 -0.4119 -0.0754 -0.1517 -0.1404 -0.1756 -0.1065 -0.1216 -0.1206 -0.1154 -0.2552 0.2614 -0.2421 -0.0556 0.0749 0.0762 0.0803 0.0615 0.0813 0.0838 0.0909 0.0725 0.0772 0.0695 0.1144 0.1048 0.0534 0.0701 0.0686 0.0874 0.0795 0.1347 0.1314
va: 2.5381 2.1100 3.0310 3.9183 3.8674 3.8903 3.7545 3.8749 3.9337 3.8891 3.9374 4.2772 3.9413 3.9816 1.0039 1.0111 1.0101 1.0066 1.0029 1.0063 1.0264 1.0188 1.0101 1.0125 1.0165 1.0002 1.0051 1.0087 1.0027 1.0069 1.0032 1.0080 0.9987
dispcorr: -0.014740071 hartree
energy: -958.857727818793
dipole: 27.59739 -27.39452 0.20287 -5.14714 5.44266 0.29552 2.46481 -3.76546 -1.30065
magnitude: 1.34914 au
magnitude: 3.42924 debye
