program: Orca
programVersion: 4.2.1
elementType: S O N C C C C C C C C C C C H H H H H H H H H H H H H H H H H H H
charge: 0
multiplicity: 1
keywords: wb97x-d3
keywords: def2-TZVPP
keywords: def2/J RIJCOSX GRIDX6 NOFINALGRIDX
keywords: grid4 nofinalgrid
keywords: scfconv7
keywords: smallprint printgap noloewdin
keywords: NOSOSCF
formula: C11H19NOS
InChI: InChI=1/C11H19NOS/c1-2-3-4-5-6-7-9-12-11(13)8-10-14-12/h8,10H,2-7,9H2,1H3
33 atoms
S  -2.168502 1.472302 0.682458
O  -2.914597 -1.389499 -1.643342
N  -2.036659 -0.073313 0.006767
C  2.303648 0.016402 -1.090139
C  1.035845 0.108547 -0.243415
C  3.274399 -1.0969 -0.698117
C  0.191073 -1.157983 -0.269686
C  3.749837 -1.068152 0.75212
C  -1.10581 -1.058968 0.522129
C  4.480745 0.209182 1.14892
C  5.048053 0.145376 2.55985
C  -2.888316 -0.33127 -1.05147
C  -3.696957 0.866527 -1.278037
C  -3.412037 1.867858 -0.43493
H  2.817849 0.980716 -1.055717
H  2.01706 -0.126111 -2.13646
H  0.444123 0.950505 -0.612453
H  1.293495 0.356552 0.792663
H  4.146754 -1.03991 -1.356505
H  2.819695 -2.070153 -0.902873
H  0.754909 -1.99628 0.149835
H  -0.045414 -1.434542 -1.30028
H  4.41548 -1.921647 0.914913
H  2.904484 -1.224987 1.430835
H  -0.899415 -0.820703 1.568363
H  -1.620274 -2.020708 0.510513
H  5.289899 0.398206 0.436494
H  3.806141 1.066346 1.071116
H  5.558747 1.069831 2.830143
H  4.259959 -0.021993 3.296082
H  5.766853 -0.669401 2.661017
H  -4.444468 0.906425 -2.054563
H  -3.86374 2.847613 -0.397298
totalener: -958.84387266 hartree
nucrepener: 1007.68791302 hartree
electener: -1966.53178567 hartree
oneelecener: -3309.59807548 hartree
twoeener: 1343.06628981 hartree
kineticenergy: 955.53213703 hartree
xcener: -75.344671645312 hartree
chargesum: 0.0000000
charge: 0.098707 -0.412794 -0.084425 -0.168611 -0.143871 -0.157891 -0.096492 -0.120227 -0.124736 -0.091060 -0.256717 0.274995 -0.246672 -0.058597 0.079917 0.080980 0.086356 0.064518 0.076219 0.079075 0.067762 0.093378 0.073839 0.055008 0.106242 0.115259 0.059927 0.052481 0.085121 0.072067 0.073918 0.134876 0.131450
qa: 0.0987 -0.4128 -0.0844 -0.1686 -0.1439 -0.1579 -0.0965 -0.1202 -0.1247 -0.0911 -0.2567 0.2750 -0.2467 -0.0586 0.0799 0.0810 0.0864 0.0645 0.0762 0.0791 0.0678 0.0934 0.0738 0.0550 0.1062 0.1153 0.0599 0.0525 0.0851 0.0721 0.0739 0.1349 0.1315
va: 2.5406 2.1121 3.0467 3.9233 3.8519 3.8995 3.7544 3.8648 3.9297 3.8703 3.9535 4.2797 3.9368 3.9857 1.0013 1.0109 1.0155 1.0016 1.0102 1.0038 1.0161 1.0257 1.0112 1.0055 1.0013 1.0179 1.0085 1.0062 1.0059 1.0025 1.0040 1.0073 0.9990
dispcorr: -0.013464709 hartree
energy: -958.857337366065
dipole: 33.33339 -32.97497 0.35842 -4.63303 5.72961 1.09659 5.39188 -4.65131 0.74056
magnitude: 1.37091 au
magnitude: 3.48458 debye
