program: Orca
programVersion: 4.2.1
elementType: S O N C C C C C C C C C C C H H H H H H H H H H H H H H H H H H H
charge: 0
multiplicity: 1
keywords: wb97x-d3
keywords: def2-TZVPP
keywords: def2/J RIJCOSX GRIDX6 NOFINALGRIDX
keywords: grid4 nofinalgrid
keywords: scfconv7
keywords: smallprint printgap noloewdin
keywords: NOSOSCF
formula: C11H19NOS
InChI: InChI=1/C11H19NOS/c1-2-3-4-5-6-7-9-12-11(13)8-10-14-12/h8,10H,2-7,9H2,1H3
33 atoms
S  -2.644144 0.029549 1.062287
O  -1.342137 0.959927 -2.342867
N  -1.950622 -0.192775 -0.464585
C  1.934174 -2.042799 0.886368
C  0.45145 -1.722743 0.710861
C  2.898804 -1.071905 0.207049
C  -0.002637 -1.713802 -0.742492
C  2.727825 0.379596 0.641561
C  -1.498522 -1.493687 -0.920192
C  3.777708 1.327915 0.067271
C  5.18632 1.090747 0.595615
C  -1.827632 0.951241 -1.231373
C  -2.377059 2.067237 -0.461768
C  -2.831591 1.70738 0.746126
H  2.127937 -3.053134 0.512472
H  2.159115 -2.070724 1.956888
H  0.226272 -0.760694 1.178668
H  -0.132018 -2.465486 1.265744
H  2.796149 -1.134588 -0.881042
H  3.916777 -1.406465 0.423987
H  0.248093 -2.671745 -1.209895
H  0.527081 -0.948346 -1.313635
H  2.74825 0.43822 1.736162
H  1.738757 0.736203 0.33973
H  -2.067569 -2.259739 -0.387766
H  -1.765724 -1.573892 -1.974628
H  3.775294 1.251444 -1.024261
H  3.483218 2.355824 0.293971
H  5.216514 1.172053 1.68382
H  5.565795 0.103553 0.330576
H  5.88705 1.822555 0.193047
H  -2.40053 3.070447 -0.857184
H  -3.278271 2.339764 1.498321
totalener: -958.84363857 hartree
nucrepener: 1026.47393704 hartree
electener: -1985.31757561 hartree
oneelecener: -3347.30227716 hartree
twoeener: 1361.98470155 hartree
kineticenergy: 955.53352529 hartree
xcener: -75.344771889549 hartree
chargesum: -0.0000000
charge: 0.099285 -0.412216 -0.076728 -0.168051 -0.142980 -0.135744 -0.100553 -0.112791 -0.123359 -0.109233 -0.252885 0.264535 -0.243532 -0.057014 0.072558 0.074313 0.068098 0.079860 0.070064 0.076320 0.072813 0.088690 0.061643 0.066343 0.105280 0.114931 0.057359 0.066525 0.072795 0.071016 0.085896 0.135095 0.131668
qa: 0.0993 -0.4122 -0.0767 -0.1681 -0.1430 -0.1357 -0.1006 -0.1128 -0.1234 -0.1092 -0.2529 0.2645 -0.2435 -0.0570 0.0726 0.0743 0.0681 0.0799 0.0701 0.0763 0.0728 0.0887 0.0616 0.0663 0.1053 0.1149 0.0574 0.0665 0.0728 0.0710 0.0859 0.1351 0.1317
va: 2.5416 2.1108 3.0324 3.9463 3.8597 3.8621 3.7498 3.8770 3.9307 3.9162 3.9318 4.2778 3.9396 3.9840 1.0092 1.0078 1.0064 1.0096 1.0047 1.0139 1.0182 1.0250 1.0092 1.0127 1.0010 1.0176 1.0096 1.0068 1.0025 1.0041 1.0064 1.0076 0.9990
dispcorr: -0.013798361 hartree
energy: -958.857436931197
dipole: 29.01501 -29.39935 -0.38433 -4.91823 4.65592 -0.26231 3.47637 -2.21005 1.26632
magnitude: 1.34910 au
magnitude: 3.42915 debye
