program: Orca
programVersion: 4.2.1
elementType: S O N C C C C C C C C C C C H H H H H H H H H H H H H H H H H H H
charge: 0
multiplicity: 1
keywords: wb97x-d3
keywords: def2-TZVPP
keywords: def2/J RIJCOSX GRIDX6 NOFINALGRIDX
keywords: grid4 nofinalgrid
keywords: scfconv7
keywords: smallprint printgap noloewdin
keywords: NOSOSCF
formula: C11H19NOS
InChI: InChI=1/C11H19NOS/c1-2-3-4-5-6-7-9-12-11(13)8-10-14-12/h8,10H,2-7,9H2,1H3
33 atoms
S  -1.241298 1.403208 -0.389023
O  -3.910993 -1.243393 -0.54727
N  -1.954104 -0.082995 -0.771924
C  1.613035 -0.994449 -0.099982
C  0.364843 -1.629457 0.501333
C  2.587763 -0.487496 0.954583
C  -0.625449 -2.171868 -0.523326
C  3.829349 0.163801 0.360164
C  -1.221959 -1.128449 -1.460433
C  4.811885 0.665875 1.410361
C  6.042344 1.323464 0.802705
C  -3.265419 -0.234091 -0.360217
C  -3.674538 1.007407 0.296378
C  -2.704476 1.930206 0.341257
H  1.341516 -0.156809 -0.752004
H  2.117402 -1.721798 -0.745974
H  -0.134545 -0.908522 1.15602
H  0.668268 -2.453462 1.153808
H  2.88596 -1.317568 1.604081
H  2.073597 0.23102 1.602112
H  -1.445256 -2.680273 -0.012165
H  -0.134791 -2.928234 -1.144149
H  3.528529 0.998947 -0.282221
H  4.336692 -0.550817 -0.297268
H  -1.921424 -1.608765 -2.14545
H  -0.452873 -0.659401 -2.076804
H  4.304707 1.375442 2.071076
H  5.119223 -0.169207 2.047042
H  6.585149 0.628531 0.159706
H  5.769583 2.186547 0.193076
H  6.734551 1.669297 1.570606
H  -4.668739 1.135911 0.694591
H  -2.75358 2.919436 0.770673
totalener: -958.84617837 hartree
nucrepener: 1006.24772391 hartree
electener: -1965.09390227 hartree
oneelecener: -3306.65041249 hartree
twoeener: 1341.55651021 hartree
kineticenergy: 955.53774857 hartree
xcener: -75.343679385592 hartree
chargesum: -0.0000000
charge: 0.087223 -0.411808 -0.061846 -0.126305 -0.151996 -0.099695 -0.113943 -0.101427 -0.144144 -0.082387 -0.258704 0.277656 -0.249543 -0.054491 0.044833 0.070825 0.076991 0.078169 0.059082 0.054318 0.100477 0.069488 0.051778 0.053292 0.115173 0.113023 0.052844 0.053412 0.073053 0.071979 0.085702 0.135621 0.131347
qa: 0.0872 -0.4118 -0.0618 -0.1263 -0.1520 -0.0997 -0.1139 -0.1014 -0.1441 -0.0824 -0.2587 0.2777 -0.2495 -0.0545 0.0448 0.0708 0.0770 0.0782 0.0591 0.0543 0.1005 0.0695 0.0518 0.0533 0.1152 0.1130 0.0528 0.0534 0.0731 0.0720 0.0857 0.1356 0.1313
va: 2.5447 2.1142 3.0236 3.8606 3.8946 3.8728 3.8169 3.8806 3.9161 3.8898 3.9534 4.2773 3.9414 3.9958 1.0049 1.0147 1.0049 1.0155 1.0146 1.0167 1.0239 1.0167 1.0094 1.0107 1.0216 0.9909 1.0075 1.0078 1.0029 1.0031 1.0059 1.0068 0.9989
dispcorr: -0.013040648 hartree
energy: -958.859219015087
dipole: 32.01754 -30.99047 1.02707 -3.92249 4.86397 0.94148 5.19902 -5.00130 0.19772
magnitude: 1.40725 au
magnitude: 3.57695 debye
