program: Orca
programVersion: 4.2.1
elementType: S O N C C C C C C C C C C C H H H H H H H H H H H H H H H H H H H
charge: 0
multiplicity: 1
keywords: wb97x-d3
keywords: def2-TZVPP
keywords: def2/J RIJCOSX GRIDX6 NOFINALGRIDX
keywords: grid4 nofinalgrid
keywords: scfconv7
keywords: smallprint printgap noloewdin
keywords: NOSOSCF
formula: C11H19NOS
InChI: InChI=1/C11H19NOS/c1-2-3-4-5-6-7-9-12-11(13)8-10-14-12/h8,10H,2-7,9H2,1H3
33 atoms
S  -2.921961 0.594283 1.072834
O  -2.416549 -0.278941 -2.55184
N  -2.185021 0.591351 -0.450032
C  1.845251 -0.955476 0.750876
C  0.599726 -0.074051 0.713564
C  3.148387 -0.23032 0.434722
C  0.296244 0.503379 -0.662957
C  4.367767 -1.133824 0.58052
C  -0.973295 1.342441 -0.719285
C  5.688073 -0.481244 0.180899
C  6.078848 0.710265 1.044748
C  -2.81854 -0.172777 -1.412717
C  -4.003436 -0.773246 -0.799479
C  -4.159213 -0.444502 0.489744
H  1.715716 -1.790729 0.054419
H  1.924491 -1.405382 1.745377
H  0.711045 0.742414 1.436677
H  -0.252287 -0.667671 1.055722
H  3.242737 0.637804 1.095204
H  3.121823 0.165738 -0.585618
H  0.221301 -0.298168 -1.402144
H  1.118004 1.145973 -0.991439
H  4.2175 -2.029755 -0.030097
H  4.436313 -1.485241 1.616077
H  -1.083634 1.781148 -1.711816
H  -0.918506 2.171205 -0.009283
H  6.480504 -1.232703 0.230885
H  5.635937 -0.171389 -0.867461
H  5.370598 1.533913 0.95122
H  6.124383 0.434409 2.100021
H  7.059451 1.095569 0.764519
H  -4.668001 -1.412914 -1.358469
H  -4.9462 -0.757175 1.159084
totalener: -958.84477826 hartree
nucrepener: 986.72114814 hartree
electener: -1945.56592640 hartree
oneelecener: -3267.71665342 hartree
twoeener: 1322.15072702 hartree
kineticenergy: 955.53373546 hartree
xcener: -75.343071950059 hartree
chargesum: 0.0000000
charge: 0.098967 -0.412517 -0.084841 -0.137948 -0.140155 -0.121052 -0.085158 -0.119282 -0.129936 -0.106098 -0.259122 0.274517 -0.246023 -0.058688 0.067053 0.069810 0.062310 0.077940 0.060091 0.061527 0.088991 0.068048 0.066657 0.060167 0.114851 0.106150 0.067771 0.052936 0.074590 0.075803 0.086951 0.134631 0.131058
qa: 0.0990 -0.4125 -0.0848 -0.1379 -0.1402 -0.1211 -0.0852 -0.1193 -0.1299 -0.1061 -0.2591 0.2745 -0.2460 -0.0587 0.0671 0.0698 0.0623 0.0779 0.0601 0.0615 0.0890 0.0680 0.0667 0.0602 0.1149 0.1062 0.0678 0.0529 0.0746 0.0758 0.0870 0.1346 0.1311
va: 2.5407 2.1124 3.0458 3.9436 3.8883 3.8617 3.7517 3.9019 3.9330 3.9025 3.9314 4.2799 3.9361 3.9849 1.0119 1.0100 1.0082 1.0177 1.0066 1.0070 1.0232 1.0194 1.0119 1.0103 1.0178 0.9995 1.0084 1.0102 1.0007 1.0022 1.0068 1.0075 0.9991
dispcorr: -0.012621125 hartree
energy: -958.857399386273
dipole: 37.28651 -37.39771 -0.11120 -1.53133 1.72322 0.19189 4.87575 -3.53810 1.33765
magnitude: 1.35591 au
magnitude: 3.44645 debye
