program: Orca
programVersion: 4.2.1
elementType: S O N C C C C C C C C C C C H H H H H H H H H H H H H H H H H H H
charge: 0
multiplicity: 1
keywords: wb97x-d3
keywords: def2-TZVPP
keywords: def2/J RIJCOSX GRIDX6 NOFINALGRIDX
keywords: grid4 nofinalgrid
keywords: scfconv7
keywords: smallprint printgap noloewdin
keywords: NOSOSCF
formula: C11H19NOS
InChI: InChI=1/C11H19NOS/c1-2-3-4-5-6-7-9-12-11(13)8-10-14-12/h8,10H,2-7,9H2,1H3
33 atoms
S  -3.28378 -0.311948 0.591962
O  -1.1671 1.804373 -1.690845
N  -2.066675 0.049013 -0.527568
C  2.145796 -2.35002 0.838991
C  1.085524 -2.08735 -0.227743
C  2.945039 -1.127572 1.283743
C  0.034894 -1.06407 0.184613
C  3.695629 -0.424076 0.159764
C  -1.058775 -0.931726 -0.866149
C  4.593126 0.701456 0.659526
C  5.334186 1.412137 -0.463436
C  -2.011222 1.370122 -0.937038
C  -3.120248 2.081257 -0.300081
C  -3.844758 1.31097 0.521696
H  2.838732 -3.108061 0.461493
H  1.663195 -2.794556 1.715005
H  0.592346 -3.035901 -0.464195
H  1.560554 -1.762448 -1.158337
H  3.663049 -1.446898 2.04548
H  2.288573 -0.409712 1.785657
H  0.493441 -0.083174 0.332289
H  -0.405894 -1.351693 1.145028
H  2.987307 -0.01459 -0.567911
H  4.30129 -1.155116 -0.387989
H  -1.546724 -1.894438 -1.040816
H  -0.63127 -0.615671 -1.818273
H  3.989038 1.425597 1.214459
H  5.314063 0.298537 1.377491
H  5.970734 2.210407 -0.081211
H  5.971201 0.720547 -1.017393
H  4.638959 1.858904 -1.175812
H  -3.302725 3.127712 -0.487119
H  -4.704542 1.598077 1.10787
totalener: -958.84585991 hartree
nucrepener: 991.97091017 hartree
electener: -1950.81677008 hartree
oneelecener: -3278.24884869 hartree
twoeener: 1327.43207861 hartree
kineticenergy: 955.53478519 hartree
xcener: -75.342673627636 hartree
chargesum: -0.0000000
charge: 0.098905 -0.411860 -0.086031 -0.153569 -0.153663 -0.128975 -0.098752 -0.118474 -0.100848 -0.080843 -0.256000 0.270586 -0.243777 -0.063085 0.074060 0.073174 0.075619 0.079173 0.072090 0.066780 0.080105 0.067311 0.059569 0.059939 0.106760 0.107402 0.055259 0.050772 0.083991 0.070527 0.078011 0.134961 0.130881
qa: 0.0989 -0.4119 -0.0860 -0.1536 -0.1537 -0.1290 -0.0988 -0.1185 -0.1008 -0.0808 -0.2560 0.2706 -0.2438 -0.0631 0.0741 0.0732 0.0756 0.0792 0.0721 0.0668 0.0801 0.0673 0.0596 0.0599 0.1068 0.1074 0.0553 0.0508 0.0840 0.0705 0.0780 0.1350 0.1309
va: 2.5390 2.1140 3.0625 3.9172 3.8889 3.8693 3.8048 3.8660 3.8537 3.8933 3.9514 4.2854 3.9341 3.9950 1.0091 1.0086 1.0127 1.0034 1.0124 1.0044 1.0174 1.0202 1.0074 1.0104 1.0050 1.0262 1.0076 1.0085 1.0060 1.0029 1.0034 1.0071 0.9994
dispcorr: -0.012380990 hartree
energy: -958.858240899870
dipole: 33.47779 -34.13618 -0.65839 -5.97802 5.25343 -0.72459 2.93961 -1.99562 0.94399
magnitude: 1.36001 au
magnitude: 3.45687 debye
