program: Orca
programVersion: 4.2.1
elementType: S O N C C C C C C C C C C C H H H H H H H H H H H H H H H H H H H
charge: 0
multiplicity: 1
keywords: wb97x-d3
keywords: def2-TZVPP
keywords: def2/J RIJCOSX GRIDX6 NOFINALGRIDX
keywords: grid4 nofinalgrid
keywords: scfconv7
keywords: smallprint printgap noloewdin
keywords: NOSOSCF
formula: C11H19NOS
InChI: InChI=1/C11H19NOS/c1-2-3-4-5-6-7-9-12-11(13)8-10-14-12/h8,10H,2-7,9H2,1H3
33 atoms
S  -3.188868 -0.521955 0.016221
O  -0.373711 1.884189 -0.681985
N  -1.660139 -0.008759 -0.500542
C  1.468454 -0.682668 1.161856
C  0.226452 -1.564328 1.270346
C  2.665735 -1.362456 0.506419
C  -0.337309 -2.064685 -0.0565
C  3.899479 -0.467776 0.415627
C  -0.716362 -0.96413 -1.040978
C  3.764652 0.672233 -0.58888
C  5.008189 1.547154 -0.651268
C  -1.413827 1.346662 -0.363497
C  -2.607811 1.961057 0.21686
C  -3.594996 1.088426 0.455176
H  1.755351 -0.372483 2.171531
H  1.222184 0.241328 0.634542
H  -0.552835 -1.014164 1.805424
H  0.453579 -2.435994 1.891572
H  2.408182 -1.702048 -0.502806
H  2.912968 -2.267096 1.071628
H  -1.208035 -2.698022 0.141681
H  0.382823 -2.715412 -0.559176
H  4.765482 -1.078039 0.140031
H  4.125804 -0.05838 1.406537
H  -1.126935 -1.404454 -1.954059
H  0.156362 -0.382243 -1.336747
H  3.565703 0.251151 -1.579613
H  2.8972 1.29251 -0.349762
H  5.891372 0.965422 -0.921555
H  4.899792 2.343365 -1.387858
H  5.209316 2.017663 0.312616
H  -2.655143 3.019247 0.420235
H  -4.567552 1.291097 0.877317
totalener: -958.84518072 hartree
nucrepener: 1034.00938405 hartree
electener: -1992.85456477 hartree
oneelecener: -3362.52159444 hartree
twoeener: 1369.66702967 hartree
kineticenergy: 955.53049736 hartree
xcener: -75.345738648882 hartree
chargesum: -0.0000000
charge: 0.096138 -0.418224 -0.075585 -0.109467 -0.140873 -0.132636 -0.166643 -0.127527 -0.117742 -0.074514 -0.266231 0.270741 -0.237014 -0.061179 0.071028 0.070354 0.075345 0.076911 0.054362 0.073329 0.086908 0.083215 0.067688 0.053314 0.124297 0.109159 0.047173 0.069998 0.069626 0.087321 0.072577 0.136005 0.132145
qa: 0.0961 -0.4182 -0.0756 -0.1095 -0.1409 -0.1326 -0.1666 -0.1275 -0.1177 -0.0745 -0.2662 0.2707 -0.2370 -0.0612 0.0710 0.0704 0.0753 0.0769 0.0544 0.0733 0.0869 0.0832 0.0677 0.0533 0.1243 0.1092 0.0472 0.0700 0.0696 0.0873 0.0726 0.1360 0.1321
va: 2.5471 2.1002 3.0438 3.8398 3.8895 3.8912 3.8727 3.9117 3.8383 3.8623 3.9563 4.2611 3.9344 4.0014 1.0144 1.0299 1.0145 1.0110 1.0093 1.0116 1.0068 1.0133 1.0095 1.0104 1.0033 1.0242 1.0078 1.0153 1.0027 1.0048 1.0034 1.0067 0.9990
dispcorr: -0.014351324 hartree
energy: -958.859532045862
dipole: 28.74581 -29.82564 -1.07983 -4.59420 3.79907 -0.79513 2.05918 -1.70822 0.35096
magnitude: 1.38615 au
magnitude: 3.52332 debye
