program: Orca
programVersion: 4.2.1
elementType: S O N C C C C C C C C C C C H H H H H H H H H H H H H H H H H H H
charge: 0
multiplicity: 1
keywords: wb97x-d3
keywords: def2-TZVPP
keywords: def2/J RIJCOSX GRIDX6 NOFINALGRIDX
keywords: grid4 nofinalgrid
keywords: scfconv7
keywords: smallprint printgap noloewdin
keywords: NOSOSCF
formula: C11H19NOS
InChI: InChI=1/C11H19NOS/c1-2-3-4-5-6-7-9-12-11(13)8-10-14-12/h8,10H,2-7,9H2,1H3
33 atoms
S  -1.211366 0.508349 -1.661962
O  -3.02498 -0.179593 1.562824
N  -2.005119 -0.39659 -0.472152
C  1.045544 -1.04656 0.603347
C  0.443414 -2.219941 -0.165508
C  2.379686 -0.585008 0.034324
C  -0.990103 -2.571235 0.241611
C  2.993607 0.5697 0.81492
C  -2.075537 -1.843171 -0.543509
C  4.297165 1.080851 0.214772
C  4.905515 2.228957 1.007358
C  -2.455014 0.324204 0.618648
C  -2.111978 1.729554 0.39789
C  -1.460613 1.944066 -0.753383
H  1.171081 -1.338148 1.651299
H  0.357588 -0.197982 0.616524
H  1.083904 -3.09294 -0.012449
H  0.486277 -2.017974 -1.242323
H  2.234478 -0.280903 -1.008172
H  3.083175 -1.424513 0.008695
H  -1.136354 -2.388225 1.308605
H  -1.168888 -3.639283 0.090781
H  3.167438 0.258125 1.850464
H  2.272174 1.392579 0.867873
H  -3.059759 -2.135264 -0.175263
H  -2.033523 -2.12939 -1.596946
H  5.015575 0.258017 0.15198
H  4.118319 1.40177 -0.816006
H  4.221071 3.077069 1.063874
H  5.134252 1.926097 2.030356
H  5.831731 2.583509 0.554644
H  -2.369673 2.4949 1.112915
H  -1.105465 2.885723 -1.143771
totalener: -958.84378007 hartree
nucrepener: 1037.35524473 hartree
electener: -1996.19902481 hartree
oneelecener: -3368.93767538 hartree
twoeener: 1372.73865057 hartree
kineticenergy: 955.53321484 hartree
xcener: -75.342815611718 hartree
chargesum: 0.0000000
charge: 0.093661 -0.404037 -0.071672 -0.124559 -0.153716 -0.095124 -0.107245 -0.101422 -0.124599 -0.080942 -0.257686 0.261587 -0.239443 -0.056194 0.075790 0.044925 0.083829 0.063337 0.046455 0.059952 0.090286 0.078108 0.055231 0.050509 0.109264 0.104462 0.052604 0.050645 0.071130 0.073754 0.084562 0.134217 0.132330
qa: 0.0937 -0.4040 -0.0717 -0.1246 -0.1537 -0.0951 -0.1072 -0.1014 -0.1246 -0.0809 -0.2577 0.2616 -0.2394 -0.0562 0.0758 0.0449 0.0838 0.0633 0.0465 0.0600 0.0903 0.0781 0.0552 0.0505 0.1093 0.1045 0.0526 0.0506 0.0711 0.0738 0.0846 0.1342 0.1323
va: 2.5395 2.1235 3.0312 3.8770 3.8642 3.8622 3.8036 3.8863 3.9391 3.8874 3.9536 4.2791 3.9234 3.9766 1.0176 1.0212 1.0121 1.0078 1.0189 1.0146 1.0215 1.0133 1.0120 1.0105 1.0181 0.9992 1.0082 1.0073 1.0032 1.0033 1.0059 1.0090 0.9984
dispcorr: -0.014216759 hartree
energy: -958.857996832596
dipole: 25.93376 -25.15271 0.78105 -2.30824 2.55321 0.24498 5.04186 -6.13920 -1.09734
magnitude: 1.36902 au
magnitude: 3.47976 debye
