program: Orca
programVersion: 4.2.1
elementType: S O N C C C C C C C C C C C H H H H H H H H H H H H H H H H H H H
charge: 0
multiplicity: 1
keywords: wb97x-d3
keywords: def2-TZVPP
keywords: def2/J RIJCOSX GRIDX6 NOFINALGRIDX
keywords: grid4 nofinalgrid
keywords: scfconv7
keywords: smallprint printgap noloewdin
keywords: NOSOSCF
formula: C11H19NOS
InChI: InChI=1/C11H19NOS/c1-2-3-4-5-6-7-9-12-11(13)8-10-14-12/h8,10H,2-7,9H2,1H3
33 atoms
S  -2.192948 0.48945 1.130028
O  -1.5427 0.424482 -2.580224
N  -1.951245 -0.182171 -0.405507
C  1.949582 -2.058843 0.426692
C  0.734719 -1.515835 -0.314796
C  3.280636 -1.496311 -0.067839
C  -0.563799 -2.167188 0.138779
C  3.392458 0.026505 -0.050018
C  -1.799569 -1.613018 -0.56071
C  3.173653 0.661276 1.318284
C  3.389695 2.167938 1.302397
C  -1.764041 0.732888 -1.429516
C  -1.878918 2.07389 -0.854498
C  -2.096198 2.071706 0.466516
H  1.976328 -3.148938 0.330978
H  1.834735 -1.86093 1.497257
H  0.858112 -1.65691 -1.39353
H  0.667086 -0.435391 -0.160509
H  3.456084 -1.847504 -1.089176
H  4.086956 -1.921204 0.538044
H  -0.669985 -2.060989 1.224044
H  -0.530037 -3.243891 -0.052321
H  2.688535 0.461424 -0.766572
H  4.386692 0.303729 -0.414127
H  -2.701893 -2.114319 -0.200773
H  -1.741483 -1.787156 -1.635287
H  2.160087 0.450618 1.671637
H  3.848534 0.200117 2.046381
H  3.227417 2.608041 2.286619
H  4.405157 2.419796 0.992216
H  2.705296 2.656065 0.606431
H  -1.784231 2.958871 -1.463726
H  -2.21537 2.924701 1.117132
totalener: -958.84524270 hartree
nucrepener: 1037.35462750 hartree
electener: -1996.19987020 hartree
oneelecener: -3368.99076044 hartree
twoeener: 1372.79089025 hartree
kineticenergy: 955.53571274 hartree
xcener: -75.344718171212 hartree
chargesum: 0.0000000
charge: 0.097012 -0.404960 -0.090896 -0.120530 -0.097486 -0.161129 -0.139819 -0.125052 -0.107868 -0.089001 -0.257707 0.261246 -0.238341 -0.058225 0.072630 0.064743 0.086685 0.043995 0.073994 0.072647 0.068763 0.074600 0.069264 0.072441 0.117275 0.110494 0.046000 0.061300 0.082845 0.073338 0.074595 0.135431 0.131715
qa: 0.0970 -0.4050 -0.0909 -0.1205 -0.0975 -0.1611 -0.1398 -0.1251 -0.1079 -0.0890 -0.2577 0.2612 -0.2383 -0.0582 0.0726 0.0647 0.0867 0.0440 0.0740 0.0726 0.0688 0.0746 0.0693 0.0724 0.1173 0.1105 0.0460 0.0613 0.0828 0.0733 0.0746 0.1354 0.1317
va: 2.5404 2.1225 3.0390 3.8597 3.8006 3.9249 3.8624 3.8667 3.8577 3.8613 3.9535 4.2806 3.9268 3.9951 1.0130 1.0026 1.0181 1.0181 1.0091 1.0091 1.0083 1.0226 1.0031 1.0107 1.0019 1.0276 1.0097 1.0076 1.0051 1.0051 1.0029 1.0072 0.9987
dispcorr: -0.013934011 hartree
energy: -958.859176707330
dipole: 25.16869 -25.24032 -0.07163 -4.90314 4.94864 0.04550 4.83176 -3.48751 1.34425
magnitude: 1.34693 au
magnitude: 3.42361 debye
