program: Orca
programVersion: 4.2.1
elementType: S O N C C C C C C C C C C C H H H H H H H H H H H H H H H H H H H
charge: 0
multiplicity: 1
keywords: wb97x-d3
keywords: def2-TZVPP
keywords: def2/J RIJCOSX GRIDX6 NOFINALGRIDX
keywords: grid4 nofinalgrid
keywords: scfconv7
keywords: smallprint printgap noloewdin
keywords: NOSOSCF
formula: C11H19NOS
InChI: InChI=1/C11H19NOS/c1-2-3-4-5-6-7-9-12-11(13)8-10-14-12/h8,10H,2-7,9H2,1H3
33 atoms
S  -1.009743 1.341824 0.172123
O  -3.736842 -0.92858 -1.078333
N  -1.8845 -0.092199 -0.031328
C  1.652641 -1.242373 0.126647
C  0.615987 -1.608525 -0.928592
C  2.926335 -0.668376 -0.482159
C  -0.660208 -2.231564 -0.37465
C  3.998128 -0.291157 0.53617
C  -1.458499 -1.341016 0.570327
C  3.615561 0.866196 1.452107
C  4.742213 1.26584 2.393908
C  -3.01105 0.009644 -0.826624
C  -3.129199 1.40204 -1.259528
C  -2.144791 2.186774 -0.801793
H  1.899651 -2.12949 0.721138
H  1.23163 -0.518418 0.831024
H  1.063305 -2.314622 -1.634342
H  0.369045 -0.721852 -1.520725
H  2.671706 0.212441 -1.081902
H  3.34188 -1.398195 -1.183799
H  -0.416047 -3.149777 0.169028
H  -1.313025 -2.528429 -1.197918
H  4.915052 -0.025666 0.000642
H  4.250533 -1.167419 1.143455
H  -0.892182 -1.110595 1.474626
H  -2.360127 -1.863905 0.89131
H  3.325328 1.726639 0.840875
H  2.732937 0.604754 2.04181
H  5.032837 0.434239 3.037978
H  5.630268 1.576119 1.840907
H  4.451066 2.094514 3.039729
H  -3.942538 1.732947 -1.885829
H  -2.005674 3.242446 -0.978935
totalener: -958.84500574 hartree
nucrepener: 1024.03691408 hartree
electener: -1982.88191982 hartree
oneelecener: -3342.21789994 hartree
twoeener: 1359.33598012 hartree
kineticenergy: 955.53851205 hartree
xcener: -75.345050074336 hartree
chargesum: -0.0000000
charge: 0.085587 -0.411936 -0.059313 -0.115920 -0.157103 -0.108282 -0.111454 -0.124525 -0.143264 -0.079501 -0.263851 0.276937 -0.249481 -0.052675 0.069678 0.034104 0.077511 0.076416 0.058072 0.072270 0.068640 0.101233 0.068715 0.055911 0.111274 0.114942 0.054332 0.052258 0.074369 0.074445 0.084504 0.135251 0.130859
qa: 0.0856 -0.4119 -0.0593 -0.1159 -0.1571 -0.1083 -0.1115 -0.1245 -0.1433 -0.0795 -0.2639 0.2769 -0.2495 -0.0527 0.0697 0.0341 0.0775 0.0764 0.0581 0.0723 0.0686 0.1012 0.0687 0.0559 0.1113 0.1149 0.0543 0.0523 0.0744 0.0744 0.0845 0.1353 0.1309
va: 2.5462 2.1145 3.0205 3.8498 3.8976 3.8897 3.8158 3.9031 3.9175 3.8639 3.9619 4.2777 3.9430 3.9966 1.0153 0.9998 1.0162 1.0049 1.0152 1.0133 1.0174 1.0237 1.0110 1.0102 0.9906 1.0221 1.0074 1.0059 1.0025 1.0038 1.0052 1.0070 0.9990
dispcorr: -0.013670041 hartree
energy: -958.858675776834
dipole: 28.30292 -27.21957 1.08335 -5.16939 6.00205 0.83266 6.18130 -5.83389 0.34741
magnitude: 1.40984 au
magnitude: 3.58354 debye
