program: Orca
programVersion: 4.2.1
elementType: S O N C C C C C C C C C C C H H H H H H H H H H H H H H H H H H H
charge: 0
multiplicity: 1
keywords: wb97x-d3
keywords: def2-TZVPP
keywords: def2/J RIJCOSX GRIDX6 NOFINALGRIDX
keywords: grid4 nofinalgrid
keywords: scfconv7
keywords: smallprint printgap noloewdin
keywords: NOSOSCF
formula: C11H19NOS
InChI: InChI=1/C11H19NOS/c1-2-3-4-5-6-7-9-12-11(13)8-10-14-12/h8,10H,2-7,9H2,1H3
33 atoms
S  -2.879409 1.042755 0.9852
O  -2.894655 -0.372488 -2.501926
N  -2.244802 0.46323 -0.472649
C  2.047705 -0.50088 0.424052
C  1.06727 -1.453735 -0.251324
C  3.50113 -0.915842 0.2336
C  -0.403812 -1.129828 -0.011457
C  4.490739 0.042979 0.88198
C  -0.828017 0.204577 -0.613236
C  5.945158 -0.365724 0.686183
C  6.925288 0.608689 1.322945
C  -3.181773 0.106209 -1.426204
C  -4.506631 0.413964 -0.886546
C  -4.474118 0.897407 0.361694
H  1.821567 -0.445638 1.49472
H  1.919257 0.514846 0.036449
H  1.259587 -2.469695 0.105068
H  1.262072 -1.475176 -1.328693
H  3.718032 -0.990998 -0.83738
H  3.64808 -1.922337 0.639964
H  -0.614176 -1.133198 1.062957
H  -1.022889 -1.913885 -0.453063
H  4.27652 0.118276 1.953644
H  4.340236 1.049192 0.475683
H  -0.61662 0.218101 -1.683393
H  -0.278766 1.037452 -0.169233
H  6.099783 -1.365971 1.1018
H  6.156357 -0.450099 -0.384077
H  6.819412 1.60901 0.899927
H  6.760734 0.689983 2.398587
H  7.958531 0.295902 1.171542
H  -5.40391 0.245633 -1.460546
H  -5.31061 1.19418 0.975988
totalener: -958.84641686 hartree
nucrepener: 962.27764923 hartree
electener: -1921.12406609 hartree
oneelecener: -3218.73362296 hartree
twoeener: 1297.60955687 hartree
kineticenergy: 955.54010650 hartree
xcener: -75.341986875421 hartree
chargesum: -0.0000000
charge: 0.099074 -0.412037 -0.089048 -0.109280 -0.137824 -0.114022 -0.115648 -0.099239 -0.092256 -0.081758 -0.259289 0.268955 -0.243111 -0.065812 0.059252 0.053642 0.070432 0.072035 0.056949 0.055684 0.064642 0.096786 0.052547 0.051215 0.107415 0.107291 0.053108 0.053450 0.072577 0.072378 0.085672 0.135304 0.130914
qa: 0.0991 -0.4120 -0.0890 -0.1093 -0.1378 -0.1140 -0.1156 -0.0992 -0.0923 -0.0818 -0.2593 0.2690 -0.2431 -0.0658 0.0593 0.0536 0.0704 0.0720 0.0569 0.0557 0.0646 0.0968 0.0525 0.0512 0.1074 0.1073 0.0531 0.0535 0.0726 0.0724 0.0857 0.1353 0.1309
va: 2.5407 2.1135 3.0686 3.8658 3.9131 3.8991 3.8647 3.8804 3.8393 3.8901 3.9532 4.2879 3.9319 3.9988 1.0099 1.0139 1.0122 1.0093 1.0118 1.0134 1.0192 1.0209 1.0105 1.0110 1.0241 1.0035 1.0078 1.0077 1.0032 1.0027 1.0062 1.0066 0.9996
dispcorr: -0.011666267 hartree
energy: -958.858083127729
dipole: 40.16082 -40.08817 0.07265 -5.20662 5.58264 0.37602 5.58987 -4.27850 1.31136
magnitude: 1.36614 au
magnitude: 3.47246 debye
