program: Orca
programVersion: 4.2.1
elementType: S O N C C C C C C C C C C C H H H H H H H H H H H H H H H H H H H
charge: 0
multiplicity: 1
keywords: wb97x-d3
keywords: def2-TZVPP
keywords: def2/J RIJCOSX GRIDX6 NOFINALGRIDX
keywords: grid4 nofinalgrid
keywords: scfconv7
keywords: smallprint printgap noloewdin
keywords: NOSOSCF
formula: C11H19NOS
InChI: InChI=1/C11H19NOS/c1-2-3-4-5-6-7-9-12-11(13)8-10-14-12/h8,10H,2-7,9H2,1H3
33 atoms
S  -1.63957 0.611198 1.215698
O  -2.123622 0.304571 -2.507789
N  -1.828118 -0.159584 -0.280471
C  2.214212 -1.962109 -0.565607
C  0.809296 -1.462073 -0.892164
C  2.67837 -1.696864 0.867587
C  -0.28216 -2.085825 -0.033037
C  2.562487 -0.24536 1.327295
C  -1.681735 -1.595787 -0.386045
C  3.342334 0.750387 0.47725
C  3.225111 2.175799 0.997292
C  -2.003255 0.686048 -1.364286
C  -2.00789 2.06058 -0.86056
C  -1.822354 2.145506 0.462302
H  2.915854 -1.503431 -1.267261
H  2.270081 -3.038181 -0.757333
H  0.592964 -1.662685 -1.945176
H  0.777394 -0.37361 -0.790216
H  3.720046 -2.019621 0.958757
H  2.11623 -2.330433 1.559943
H  -0.086595 -1.901299 1.028159
H  -0.272687 -3.173786 -0.151211
H  2.913683 -0.178943 2.362016
H  1.509375 0.055591 1.356863
H  -2.429081 -2.083487 0.245531
H  -1.925209 -1.839934 -1.420246
H  4.395555 0.454293 0.444598
H  2.989211 0.718357 -0.557189
H  2.184145 2.504187 1.006222
H  3.60415 2.259208 2.017278
H  3.785798 2.877133 0.379062
H  -2.143573 2.902559 -1.520822
H  -1.784522 3.038241 1.06791
totalener: -958.84435365 hartree
nucrepener: 1054.68406293 hartree
electener: -2013.52841658 hartree
oneelecener: -3403.58071919 hartree
twoeener: 1390.05230261 hartree
kineticenergy: 955.53299130 hartree
xcener: -75.346699534185 hartree
chargesum: 0.0000000
charge: 0.093288 -0.405003 -0.081241 -0.169696 -0.084829 -0.151924 -0.155970 -0.096786 -0.109769 -0.100097 -0.253342 0.259168 -0.231905 -0.060348 0.082545 0.074102 0.094557 0.052632 0.075055 0.073893 0.069246 0.078001 0.073001 0.032045 0.118249 0.109970 0.061693 0.056958 0.067901 0.072480 0.087112 0.136112 0.132905
qa: 0.0933 -0.4050 -0.0812 -0.1697 -0.0848 -0.1519 -0.1560 -0.0968 -0.1098 -0.1001 -0.2533 0.2592 -0.2319 -0.0603 0.0825 0.0741 0.0946 0.0526 0.0751 0.0739 0.0692 0.0780 0.0730 0.0320 0.1182 0.1100 0.0617 0.0570 0.0679 0.0725 0.0871 0.1361 0.1329
va: 2.5323 2.1225 3.0348 3.9069 3.8014 3.8829 3.8532 3.8616 3.8605 3.8725 3.9524 4.2865 3.9175 3.9794 1.0016 1.0110 1.0187 1.0180 1.0105 1.0042 1.0027 1.0223 1.0135 1.0248 1.0005 1.0287 1.0088 1.0066 1.0035 1.0041 1.0061 1.0073 0.9979
dispcorr: -0.015074325 hartree
energy: -958.859427973227
dipole: 23.77898 -23.44527 0.33371 -5.15992 5.29276 0.13284 3.75032 -2.45321 1.29711
magnitude: 1.34592 au
magnitude: 3.42105 debye
