program: Orca
programVersion: 4.2.1
elementType: S O N C C C C C C C C C C C H H H H H H H H H H H H H H H H H H H
charge: 0
multiplicity: 1
keywords: wb97x-d3
keywords: def2-TZVPP
keywords: def2/J RIJCOSX GRIDX6 NOFINALGRIDX
keywords: grid4 nofinalgrid
keywords: scfconv7
keywords: smallprint printgap noloewdin
keywords: NOSOSCF
formula: C11H19NOS
InChI: InChI=1/C11H19NOS/c1-2-3-4-5-6-7-9-12-11(13)8-10-14-12/h8,10H,2-7,9H2,1H3
33 atoms
S  -3.065311 -0.489024 -0.077149
O  -0.217526 1.914885 -0.639629
N  -1.518545 0.02574 -0.536978
C  1.534987 -0.734918 1.196988
C  0.292054 -1.622125 1.229685
C  2.73197 -1.364125 0.493759
C  -0.23285 -2.062422 -0.133705
C  4.009942 -0.534375 0.599685
C  -0.570536 -0.92042 -1.085205
C  3.921036 0.875917 0.018491
C  3.52311 0.91693 -1.450072
C  -1.268052 1.375796 -0.360241
C  -2.472964 1.983514 0.204631
C  -3.471758 1.112208 0.393604
H  1.814104 -0.501796 2.22959
H  1.294395 0.226201 0.736593
H  -0.503132 -1.100371 1.769759
H  0.506401 -2.522039 1.813948
H  2.501285 -1.53815 -0.562209
H  2.921317 -2.355105 0.920136
H  -1.11401 -2.695982 0.009971
H  0.499613 -2.697772 -0.638385
H  4.819708 -1.073316 0.097454
H  4.302689 -0.466307 1.652378
H  -0.956259 -1.319551 -2.027629
H  0.318081 -0.339317 -1.330519
H  3.217522 1.479969 0.597197
H  4.894629 1.358018 0.141535
H  4.170718 0.280925 -2.057342
H  2.494043 0.589765 -1.600306
H  3.587791 1.930221 -1.845776
H  -2.518963 3.036279 0.43452
H  -4.453817 1.311399 0.794926
totalener: -958.84421676 hartree
nucrepener: 1052.03114625 hartree
electener: -2010.87536301 hartree
oneelecener: -3398.58589629 hartree
twoeener: 1387.71053327 hartree
kineticenergy: 955.52927117 hartree
xcener: -75.347494661365 hartree
chargesum: -0.0000000
charge: 0.095655 -0.418189 -0.071702 -0.100995 -0.148497 -0.148646 -0.160128 -0.148266 -0.120653 -0.114835 -0.253474 0.271467 -0.236990 -0.061344 0.074099 0.071118 0.075334 0.077031 0.060718 0.074290 0.087721 0.083505 0.071128 0.065949 0.124802 0.105034 0.071356 0.065320 0.075829 0.076568 0.088458 0.136062 0.132273
qa: 0.0957 -0.4182 -0.0717 -0.1010 -0.1485 -0.1486 -0.1601 -0.1483 -0.1207 -0.1148 -0.2535 0.2715 -0.2370 -0.0613 0.0741 0.0711 0.0753 0.0770 0.0607 0.0743 0.0877 0.0835 0.0711 0.0659 0.1248 0.1050 0.0714 0.0653 0.0758 0.0766 0.0885 0.1361 0.1323
va: 2.5468 2.1001 3.0481 3.8120 3.9001 3.8654 3.8625 3.9189 3.8719 3.8810 3.9369 4.2601 3.9344 4.0004 1.0124 1.0305 1.0149 1.0110 1.0012 1.0138 1.0065 1.0128 1.0075 1.0118 1.0052 1.0181 1.0043 1.0083 1.0023 1.0022 1.0101 1.0066 0.9990
dispcorr: -0.015461565 hartree
energy: -958.859678325311
dipole: 26.06752 -27.14087 -1.07336 -5.72262 4.96137 -0.76125 1.53812 -1.20696 0.33116
magnitude: 1.35693 au
magnitude: 3.44905 debye
