program: Orca
programVersion: 4.2.1
elementType: O O O O N C C C C C C C C C C C C C C C H H H H H H H H H H H H H H H H H H H H H
charge: 0
multiplicity: 1
keywords: wb97x-d3
keywords: def2-TZVPP
keywords: def2/J RIJCOSX GRIDX6 NOFINALGRIDX
keywords: grid4 nofinalgrid
keywords: scfconv7
keywords: smallprint printgap noloewdin
keywords: NOSOSCF
formula: C15H21NO4
InChI: InChI=1/C15H21NO4/c1-10-7-6-8-11(2)14(10)16(13(17)9-19-4)12(3)15(18)20-5/h6-8,12H,9H2,1-5H3
41 atoms
O  -3.320141 -1.353483 0.282353
O  -0.242888 3.329306 -0.986083
O  -1.770873 1.29841 -0.101744
O  -2.138622 -1.206051 -1.599702
N  -0.059127 -0.145001 0.093423
C  -0.960919 -1.220222 0.504146
C  1.345722 -0.389297 0.143946
C  2.089961 0.044784 1.247296
C  1.945589 -1.090958 -0.911248
C  -1.240656 -1.215762 1.997707
C  -0.574824 1.068274 -0.200137
C  -2.195114 -1.225203 -0.394659
C  3.45131 -0.25211 1.281982
C  3.305227 -1.367854 -0.83493
C  1.511583 0.841036 2.381483
C  1.161677 -1.546478 -2.103969
C  4.054351 -0.956903 0.256623
C  0.397913 2.114258 -0.73149
C  -4.531845 -1.424039 -0.471514
C  -0.401973 4.132008 0.165697
H  -0.447293 -2.156486 0.263831
H  -0.301318 -1.290228 2.544154
H  -1.756789 -0.313523 2.322355
H  -1.838507 -2.08034 2.281595
H  4.040453 0.079642 2.128286
H  3.782376 -1.904537 -1.645457
H  0.456354 1.074864 2.268027
H  1.622717 0.304224 3.324583
H  2.046325 1.785456 2.492473
H  1.820505 -1.687232 -2.959573
H  0.670987 -2.504297 -1.916369
H  0.384427 -0.841344 -2.388495
H  5.112608 -1.178257 0.300962
H  1.252478 2.243183 -0.057112
H  0.804829 1.744794 -1.678619
H  -4.683632 -0.521407 -1.062557
H  -5.331313 -1.512743 0.257861
H  -4.543582 -2.294394 -1.126404
H  -1.010447 3.653091 0.937791
H  -0.903054 5.049269 -0.140161
H  0.564881 4.398961 0.606186
elementType: O N C H
totalener: -940.00560810 hartree
nucrepener: 1703.67927075 hartree
electener: -2643.68487884 hartree
oneelecener: -4666.25770896 hartree
twoeener: 2022.57283011 hartree
cpcmener: -0.04094272 hartree
kineticenergy: 935.90699415 hartree
xcener: -90.042523436189 hartree
chargesum: -0.0000000
charge: -0.275572 -0.386248 -0.512210 -0.470613 0.021117 0.124268 0.126799 -0.202227 -0.144880 -0.320223 0.263648 0.427699 -0.091950 -0.065232 -0.319310 -0.271850 -0.184369 0.013523 -0.126935 -0.108348 0.115409 0.110088 0.105753 0.112386 0.141301 0.139333 0.098585 0.128903 0.125244 0.107417 0.101626 0.104192 0.160956 0.133571 0.139143 0.115799 0.127062 0.116749 0.096639 0.126094 0.096664
qa: -0.2756 -0.3862 -0.5122 -0.4706 0.0211 0.1243 0.1268 -0.2022 -0.1449 -0.3202 0.2636 0.4277 -0.0920 -0.0652 -0.3193 -0.2719 -0.1844 0.0135 -0.1269 -0.1083 0.1154 0.1101 0.1058 0.1124 0.1413 0.1393 0.0986 0.1289 0.1252 0.1074 0.1016 0.1042 0.1610 0.1336 0.1391 0.1158 0.1271 0.1167 0.0966 0.1261 0.0967
va: 2.1388 1.9296 1.9945 2.0274 2.9496 3.7457 3.5084 3.8486 3.8782 3.9658 3.9875 4.1156 3.8381 3.7924 3.9300 3.9403 3.9442 3.9830 3.8706 3.8734 1.0017 0.9912 1.0097 1.0127 0.9976 1.0017 1.0016 0.9912 0.9938 1.0030 0.9977 1.0095 0.9893 0.9882 0.9990 0.9943 0.9954 0.9928 0.9924 0.9896 0.9926
dispcorr: -0.022827563 hartree
energy: -940.028435660815
dipole: 1.96491 -0.28752 1.67740 1.72299 -2.81712 -1.09414 6.46832 -4.67697 1.79135
magnitude: 2.68696 au
magnitude: 6.82971 debye
