program: Orca
programVersion: 4.2.1
elementType: O O O O N C C C C C C C C C C C C C C C H H H H H H H H H H H H H H H H H H H H H
charge: 0
multiplicity: 1
keywords: wb97x-d3
keywords: def2-TZVPP
keywords: def2/J RIJCOSX GRIDX6 NOFINALGRIDX
keywords: grid4 nofinalgrid
keywords: scfconv7
keywords: smallprint printgap noloewdin
keywords: NOSOSCF
formula: C15H21NO4
InChI: InChI=1/C15H21NO4/c1-10-7-6-8-11(2)14(10)16(13(17)9-19-4)12(3)15(18)20-5/h6-8,12H,9H2,1-5H3
41 atoms
O  -3.431796 -1.626265 -0.09705
O  0.482579 2.693736 -0.253266
O  -1.918247 0.776735 -1.578592
O  -2.648821 -0.029706 1.252114
N  -0.270267 -0.108254 -0.334395
C  -1.11118 -1.286896 -0.131519
C  1.123018 -0.150625 -0.015468
C  1.58064 0.311462 1.218239
C  1.998748 -0.690157 -0.96749
C  -0.502081 -2.283488 0.84694
C  -0.784677 0.864187 -1.122585
C  -2.470106 -0.871929 0.407635
C  2.949625 0.251185 1.474825
C  3.356767 -0.727465 -0.676943
C  0.674428 0.869917 2.271406
C  1.493169 -1.235976 -2.270296
C  3.831256 -0.256312 0.538309
C  0.10024 2.055934 -1.442149
C  -4.756362 -1.426386 0.402196
C  1.747214 3.310131 -0.334345
H  -1.263969 -1.795488 -1.087846
H  -0.320989 -1.842331 1.826213
H  -1.184822 -3.123083 0.974996
H  0.435138 -2.687226 0.467864
H  3.323259 0.611417 2.42594
H  4.046193 -1.135821 -1.405273
H  -0.371938 0.849223 1.986035
H  0.780005 0.306427 3.199002
H  0.939433 1.902423 2.49883
H  0.852338 -2.107607 -2.123347
H  0.914095 -0.508472 -2.841036
H  2.321772 -1.551703 -2.901517
H  4.891026 -0.290791 0.754943
H  0.969934 1.708652 -2.015628
H  -0.462926 2.729228 -2.096783
H  -5.106537 -0.414106 0.203873
H  -4.813676 -1.628962 1.471154
H  -5.385085 -2.133352 -0.130566
H  1.770879 4.102601 -1.089958
H  2.536819 2.587335 -0.567521
H  1.962844 3.75547 0.635844
elementType: O N C H
totalener: -940.00307964 hartree
nucrepener: 1732.77690936 hartree
electener: -2672.77998901 hartree
oneelecener: -4724.62417121 hartree
twoeener: 2051.84418220 hartree
cpcmener: -0.03802743 hartree
kineticenergy: 935.92032504 hartree
xcener: -90.043185714046 hartree
chargesum: 0.0000000
charge: -0.286105 -0.361940 -0.518589 -0.468765 0.016220 0.054156 0.204153 -0.166562 -0.274864 -0.271695 0.319908 0.420569 -0.066362 -0.043574 -0.309076 -0.240477 -0.197304 -0.010813 -0.123755 -0.105455 0.102501 0.115559 0.120388 0.113271 0.136495 0.140596 0.093501 0.123091 0.106657 0.107475 0.098589 0.103239 0.160435 0.118376 0.102331 0.117199 0.117725 0.131818 0.121589 0.085213 0.114282
qa: -0.2861 -0.3619 -0.5186 -0.4688 0.0162 0.0542 0.2042 -0.1666 -0.2749 -0.2717 0.3199 0.4206 -0.0664 -0.0436 -0.3091 -0.2405 -0.1973 -0.0108 -0.1238 -0.1055 0.1025 0.1156 0.1204 0.1133 0.1365 0.1406 0.0935 0.1231 0.1067 0.1075 0.0986 0.1032 0.1604 0.1184 0.1023 0.1172 0.1177 0.1318 0.1216 0.0852 0.1143
va: 2.1364 1.9181 1.9924 2.0281 2.9653 3.8070 3.2387 3.7945 3.9436 3.9442 4.0677 4.1331 3.8038 3.7743 3.9212 3.9550 3.9417 3.9876 3.8610 3.8826 1.0338 0.9950 1.0104 0.9983 0.9985 1.0005 1.0372 0.9941 1.0006 0.9937 1.0003 1.0052 0.9888 0.9805 1.0193 0.9933 0.9931 0.9945 0.9928 0.9864 0.9908
dispcorr: -0.024640803 hartree
energy: -940.027720445150
dipole: 6.74306 -4.64749 2.09556 -1.42180 0.17668 -1.24512 1.07743 -1.34556 -0.26812
magnitude: 2.45227 au
magnitude: 6.23317 debye
