program: Orca
programVersion: 4.2.1
elementType: O O O O N C C C C C C C C C C C C C C C H H H H H H H H H H H H H H H H H H H H H
charge: 0
multiplicity: 1
keywords: wb97x-d3
keywords: def2-TZVPP
keywords: def2/J RIJCOSX GRIDX6 NOFINALGRIDX
keywords: grid4 nofinalgrid
keywords: scfconv7
keywords: smallprint printgap noloewdin
keywords: NOSOSCF
formula: C15H21NO4
InChI: InChI=1/C15H21NO4/c1-10-7-6-8-11(2)14(10)16(13(17)9-19-4)12(3)15(18)20-5/h6-8,12H,9H2,1-5H3
41 atoms
O  -3.396496 -1.297054 -0.10786
O  -0.095581 3.403984 -0.96037
O  -1.70494 1.245012 -0.825131
O  -2.387124 -0.35508 1.645082
N  -0.09776 -0.136631 -0.084213
C  -1.048901 -1.244595 -0.161582
C  1.286657 -0.371618 0.170821
C  1.81065 -0.170117 1.448757
C  2.090177 -0.812709 -0.890641
C  -0.513299 -2.520329 0.476161
C  -0.546544 1.078408 -0.483183
C  -2.33743 -0.873538 0.55901
C  3.168839 -0.417927 1.648848
C  3.436745 -1.050868 -0.650564
C  0.982873 0.324166 2.596294
C  1.515863 -1.018992 -2.260043
C  3.974142 -0.854758 0.613861
C  0.453719 2.22899 -0.456761
C  -4.674417 -1.092139 0.494339
C  -0.10283 3.471953 -2.368601
H  -1.288352 -1.449617 -1.208836
H  0.369482 -2.890577 -0.042704
H  -0.26286 -2.379288 1.527251
H  -1.272355 -3.300274 0.41143
H  3.593114 -0.266134 2.634175
H  4.071464 -1.390481 -1.459757
H  1.216326 -0.229625 3.506253
H  1.199582 1.374504 2.8053
H  -0.085525 0.239048 2.418061
H  0.809013 -1.850901 -2.288331
H  0.984985 -0.138463 -2.626308
H  2.301817 -1.244616 -2.978949
H  5.025571 -1.043507 0.788962
H  0.739317 2.416827 0.583217
H  1.37616 1.950058 -0.984063
H  -4.758723 -1.616805 1.446179
H  -5.40169 -1.4978 -0.203474
H  -4.876757 -0.031824 0.646232
H  -0.713437 2.691839 -2.8324
H  0.910535 3.406209 -2.781875
H  -0.520937 4.438281 -2.648637
elementType: O N C H
totalener: -940.01346942 hartree
nucrepener: 1703.66437766 hartree
electener: -2643.67784708 hartree
oneelecener: -4666.00597442 hartree
twoeener: 2022.32812735 hartree
cpcmener: -0.03193146 hartree
kineticenergy: 935.90924368 hartree
xcener: -90.040502728661 hartree
chargesum: -0.0000000
charge: -0.280643 -0.366604 -0.479215 -0.449187 0.013173 0.062173 0.111549 -0.150228 -0.263027 -0.274916 0.281683 0.408713 -0.060510 -0.025004 -0.309665 -0.243413 -0.191841 0.002195 -0.125027 -0.113232 0.096682 0.110434 0.113766 0.117312 0.137261 0.138439 0.112254 0.115953 0.107673 0.101607 0.101578 0.102770 0.157751 0.142072 0.124664 0.115339 0.128717 0.116474 0.096173 0.094487 0.121623
qa: -0.2806 -0.3666 -0.4792 -0.4492 0.0132 0.0622 0.1115 -0.1502 -0.2630 -0.2749 0.2817 0.4087 -0.0605 -0.0250 -0.3097 -0.2434 -0.1918 0.0022 -0.1250 -0.1132 0.0967 0.1104 0.1138 0.1173 0.1373 0.1384 0.1123 0.1160 0.1077 0.1016 0.1016 0.1028 0.1578 0.1421 0.1247 0.1153 0.1287 0.1165 0.0962 0.0945 0.1216
va: 2.1374 1.9504 2.0426 2.0519 2.9172 3.8183 3.3685 3.8816 3.9396 3.9469 3.9725 4.1582 3.8091 3.7688 3.9131 3.9652 3.9604 3.9653 3.8691 3.8851 1.0312 0.9988 0.9976 1.0098 1.0000 1.0009 0.9985 0.9927 1.0290 0.9946 0.9962 1.0058 0.9904 0.9980 0.9897 0.9933 0.9950 0.9936 0.9926 0.9921 0.9909
dispcorr: -0.022830542 hartree
energy: -940.036299957147
dipole: 3.46107 -1.84320 1.61788 -2.82719 1.09167 -1.73551 -3.11617 2.41831 -0.69786
magnitude: 2.47316 au
magnitude: 6.28628 debye
