program: Orca
programVersion: 4.2.1
elementType: O O O O N C C C C C C C C C C C C C C C H H H H H H H H H H H H H H H H H H H H H
charge: 0
multiplicity: 1
keywords: wb97x-d3
keywords: def2-TZVPP
keywords: def2/J RIJCOSX GRIDX6 NOFINALGRIDX
keywords: grid4 nofinalgrid
keywords: scfconv7
keywords: smallprint printgap noloewdin
keywords: NOSOSCF
formula: C15H21NO4
InChI: InChI=1/C15H21NO4/c1-10-7-6-8-11(2)14(10)16(13(17)9-19-4)12(3)15(18)20-5/h6-8,12H,9H2,1-5H3
41 atoms
O  -3.378737 -1.397437 -0.101466
O  0.733962 2.714823 -0.358507
O  -1.664135 0.766268 -1.661468
O  -2.4783 0.175815 1.198967
N  -0.10235 -0.166813 -0.346499
C  -1.035153 -1.265724 -0.101688
C  1.277469 -0.298736 -0.000223
C  1.753729 0.187786 1.216926
C  2.120492 -0.960292 -0.905355
C  -0.522835 -2.256314 0.935947
C  -0.539231 0.805018 -1.18404
C  -2.36325 -0.70978 0.390837
C  3.107212 0.015964 1.508192
C  3.462466 -1.108154 -0.580518
C  0.882045 0.872893 2.223784
C  1.593242 -1.510239 -2.19761
C  3.954994 -0.620387 0.621408
C  0.405431 1.962346 -1.491634
C  -4.686342 -1.045138 0.349471
C  -0.358262 3.434145 0.168855
H  -1.216918 -1.807033 -1.034972
H  -1.267567 -3.038656 1.083312
H  0.392452 -2.744043 0.604241
H  -0.334717 -1.78433 1.899766
H  3.494574 0.389311 2.44899
H  4.126391 -1.613339 -1.271247
H  1.212129 1.900286 2.382929
H  -0.163964 0.898506 1.934246
H  0.947316 0.368604 3.189675
H  1.098317 -0.753883 -2.810215
H  2.401198 -1.927609 -2.797123
H  0.869723 -2.312303 -2.035434
H  5.002554 -0.7424 0.865853
H  1.341088 1.593558 -1.918612
H  -0.084539 2.575839 -2.257458
H  -4.931706 -0.014705 0.091972
H  -4.790257 -1.183811 1.425679
H  -5.37054 -1.714055 -0.165183
H  0.017897 4.055819 0.980285
H  -1.142327 2.78604 0.575125
H  -0.815108 4.088543 -0.583044
elementType: O N C H
totalener: -940.01081554 hartree
nucrepener: 1732.93151847 hartree
electener: -2672.94233402 hartree
oneelecener: -4724.80763825 hartree
twoeener: 2051.86530423 hartree
cpcmener: -0.02764635 hartree
kineticenergy: 935.91244957 hartree
xcener: -90.038262560868 hartree
chargesum: 0.0000000
charge: -0.281693 -0.353320 -0.480338 -0.444556 0.044429 0.056163 0.167300 -0.138120 -0.273516 -0.276643 0.214203 0.405111 -0.072624 -0.031043 -0.321911 -0.249286 -0.196573 0.064780 -0.124583 -0.124775 0.097331 0.118211 0.113176 0.115757 0.135716 0.138277 0.113725 0.085460 0.125058 0.101094 0.102141 0.106614 0.157010 0.116144 0.105597 0.115747 0.114726 0.129525 0.119361 0.095308 0.111017
qa: -0.2817 -0.3533 -0.4803 -0.4446 0.0444 0.0562 0.1673 -0.1381 -0.2735 -0.2766 0.2142 0.4051 -0.0726 -0.0310 -0.3219 -0.2493 -0.1966 0.0648 -0.1246 -0.1248 0.0973 0.1182 0.1132 0.1158 0.1357 0.1383 0.1137 0.0855 0.1251 0.1011 0.1021 0.1066 0.1570 0.1161 0.1056 0.1157 0.1147 0.1295 0.1194 0.0953 0.1110
va: 2.1373 1.9328 2.0308 2.0518 2.9053 3.8112 3.3229 3.8450 3.9415 3.9439 4.0773 4.1485 3.8182 3.7612 3.9095 3.9637 3.9606 3.8609 3.8691 3.8947 1.0353 1.0104 0.9978 0.9952 0.9993 1.0009 0.9973 1.0359 0.9955 0.9974 1.0052 0.9933 0.9905 0.9942 1.0128 0.9937 0.9935 0.9946 0.9886 0.9876 0.9986
dispcorr: -0.024513167 hartree
energy: -940.035328711824
dipole: 0.67228 0.05696 0.72924 -1.08745 -0.11427 -1.20172 2.82253 -2.67434 0.14820
magnitude: 1.41346 au
magnitude: 3.59274 debye
