program: Orca
programVersion: 4.2.1
elementType: O O O O N C C C C C C C C C C C C C C C H H H H H H H H H H H H H H H H H H H H H
charge: 0
multiplicity: 1
keywords: wb97x-d3
keywords: def2-TZVPP
keywords: def2/J RIJCOSX GRIDX6 NOFINALGRIDX
keywords: grid4 nofinalgrid
keywords: scfconv7
keywords: smallprint printgap noloewdin
keywords: NOSOSCF
formula: C15H21NO4
InChI: InChI=1/C15H21NO4/c1-10-7-6-8-11(2)14(10)16(13(17)9-19-4)12(3)15(18)20-5/h6-8,12H,9H2,1-5H3
41 atoms
O  -3.468557 -1.541913 -0.190435
O  0.945466 2.275384 -1.563322
O  -2.070691 1.1728 -0.918306
O  -2.551847 -0.507943 1.564596
N  -0.31256 -0.019502 -0.183134
C  -1.141539 -1.219394 -0.266555
C  1.074434 -0.107521 0.132603
C  1.513193 0.184044 1.426547
C  1.96916 -0.516183 -0.864696
C  -0.468127 -2.442042 0.347926
C  -0.905277 1.14284 -0.583409
C  -2.456707 -1.001362 0.475141
C  2.875494 0.077576 1.702278
C  3.317144 -0.615092 -0.548313
C  0.572333 0.620994 2.51054
C  1.493579 -0.838831 -2.249242
C  3.771116 -0.317404 0.727072
C  -0.045095 2.398144 -0.58271
C  -4.751851 -1.438294 0.409703
C  2.12281 2.976254 -1.274425
H  -1.375319 -1.428616 -1.314599
H  -1.140886 -3.296279 0.271955
H  0.453665 -2.704678 -0.168214
H  -0.234559 -2.286227 1.400252
H  3.22941 0.298361 2.701907
H  4.019042 -0.92859 -1.311254
H  -0.40351 0.14688 2.440536
H  0.991513 0.403091 3.492157
H  0.398797 1.699778 2.475286
H  0.928351 -0.012934 -2.678003
H  2.336067 -1.044427 -2.908089
H  0.850482 -1.721331 -2.268666
H  4.824801 -0.400213 0.959878
H  -0.705521 3.249123 -0.782198
H  0.389145 2.54541 0.415269
H  -4.789922 -1.945999 1.374068
H  -5.443814 -1.915114 -0.279111
H  -5.038678 -0.396238 0.54953
H  2.824036 2.789602 -2.086334
H  2.580533 2.632972 -0.338862
H  1.957854 4.058344 -1.204493
totalener: -939.99067863 hartree
nucrepener: 1731.83628845 hartree
electener: -2671.82696708 hartree
oneelecener: -4721.65156118 hartree
twoeener: 2049.82459410 hartree
kineticenergy: 935.95484150 hartree
xcener: -90.041243615062 hartree
chargesum: 0.0000000
charge: -0.264260 -0.317244 -0.384424 -0.382185 0.006674 0.040906 0.194956 -0.217467 -0.278870 -0.274401 0.302547 0.379347 -0.020572 0.002206 -0.270405 -0.250235 -0.175391 -0.043807 -0.134990 -0.110339 0.091406 0.110370 0.102334 0.112185 0.109211 0.106426 0.134120 0.089475 0.089269 0.119200 0.085088 0.086346 0.126152 0.107691 0.094288 0.105586 0.116852 0.117651 0.107467 0.081940 0.104898
qa: -0.2643 -0.3172 -0.3844 -0.3822 0.0067 0.0409 0.1950 -0.2175 -0.2789 -0.2744 0.3025 0.3793 -0.0206 0.0022 -0.2704 -0.2502 -0.1754 -0.0438 -0.1350 -0.1103 0.0914 0.1104 0.1023 0.1122 0.1092 0.1064 0.1341 0.0895 0.0893 0.1192 0.0851 0.0863 0.1262 0.1077 0.0943 0.1056 0.1169 0.1177 0.1075 0.0819 0.1049
va: 2.1419 1.9562 2.1333 2.1142 2.9360 3.8776 3.3235 3.8940 3.9278 3.9288 4.1138 4.1808 3.8283 3.8134 3.9381 3.9491 4.0388 3.9691 3.9009 3.9088 1.0284 1.0107 1.0014 1.0005 1.0096 1.0090 1.0234 1.0041 0.9941 1.0122 1.0082 0.9974 1.0009 1.0159 0.9850 0.9945 0.9946 0.9948 0.9946 0.9842 0.9922
dispcorr: -0.024542193 hartree
energy: -940.015220825148
dipole: 6.45907 -5.37284 1.08624 -0.83428 0.40899 -0.42530 0.90228 -0.77739 0.12488
magnitude: 1.17319 au
magnitude: 2.98202 debye
