program: Orca
programVersion: 4.2.1
elementType: O O O O N C C C C C C C C C C C C C C C H H H H H H H H H H H H H H H H H H H H H
charge: 0
multiplicity: 1
keywords: wb97x-d3
keywords: def2-TZVPP
keywords: def2/J RIJCOSX GRIDX6 NOFINALGRIDX
keywords: grid4 nofinalgrid
keywords: scfconv7
keywords: smallprint printgap noloewdin
keywords: NOSOSCF
formula: C15H21NO4
InChI: InChI=1/C15H21NO4/c1-10-7-6-8-11(2)14(10)16(13(17)9-19-4)12(3)15(18)20-5/h6-8,12H,9H2,1-5H3
41 atoms
O  -2.263137 -0.916224 -1.080642
O  -0.284609 3.347837 -0.588694
O  -1.70146 1.336273 0.587904
O  -3.29184 -1.494713 0.81426
N  -0.042765 -0.167975 0.351725
C  -0.898276 -1.248225 0.832869
C  1.346534 -0.43395 0.189034
C  2.254784 -0.089108 1.195366
C  1.77711 -1.064819 -0.988131
C  -0.972619 -1.338376 2.349324
C  -0.56241 1.090661 0.258979
C  -2.295852 -1.200615 0.218632
C  3.600025 -0.4026 1.009825
C  3.124488 -1.363983 -1.130264
C  1.864308 0.628682 2.45697
C  0.815044 -1.394117 -2.090005
C  4.033369 -1.040084 -0.135382
C  0.368279 2.156366 -0.324469
C  -3.520518 -0.79204 -1.728792
C  -1.099503 3.320188 -1.7306
H  -0.445077 -2.175111 0.461688
H  -1.417932 -0.442383 2.777768
H  -1.577087 -2.190814 2.652123
H  0.024857 -1.474544 2.764845
H  4.312525 -0.138841 1.782297
H  3.467189 -1.848484 -2.03604
H  2.14452 0.044933 3.334885
H  2.390123 1.582237 2.531246
H  0.800864 0.835198 2.533585
H  0.132911 -2.199755 -1.816147
H  0.19221 -0.540793 -2.354741
H  1.351471 -1.712403 -2.982392
H  5.081532 -1.2778 -0.260515
H  1.161432 2.377159 0.395616
H  0.870003 1.750043 -1.217392
H  -4.086212 -1.72358 -1.699704
H  -3.301676 -0.533809 -2.761735
H  -4.119431 -0.002131 -1.275382
H  -1.470718 4.331699 -1.888483
H  -1.958795 2.65302 -1.62351
H  -0.535406 3.020409 -2.624266
totalener: -939.99031887 hartree
nucrepener: 1718.94879615 hartree
electener: -2658.93911502 hartree
oneelecener: -4695.41724794 hartree
twoeener: 2036.47813292 hartree
kineticenergy: 935.95111320 hartree
xcener: -90.040186369415 hartree
chargesum: -0.0000000
charge: -0.268345 -0.304540 -0.379005 -0.346923 0.047931 0.073395 0.099045 -0.200534 -0.166331 -0.310380 0.210211 0.368563 -0.056073 -0.022010 -0.339194 -0.224360 -0.149200 0.007669 -0.141584 -0.111082 0.087325 0.111780 0.112582 0.096758 0.113984 0.110282 0.115885 0.116069 0.116812 0.086340 0.088258 0.090065 0.128158 0.118738 0.096803 0.117192 0.104278 0.122627 0.111097 0.095121 0.072593
qa: -0.2683 -0.3045 -0.3790 -0.3469 0.0479 0.0734 0.0990 -0.2005 -0.1663 -0.3104 0.2102 0.3686 -0.0561 -0.0220 -0.3392 -0.2244 -0.1492 0.0077 -0.1416 -0.1111 0.0873 0.1118 0.1126 0.0968 0.1140 0.1103 0.1159 0.1161 0.1168 0.0863 0.0883 0.0901 0.1282 0.1187 0.0968 0.1172 0.1043 0.1226 0.1111 0.0951 0.0726
va: 2.1074 2.0238 2.1297 2.1682 2.8406 3.8196 3.5925 3.8795 3.9554 3.9699 4.0266 4.1832 3.8932 3.8347 3.9435 3.9739 4.0185 4.0042 3.8945 3.9206 1.0038 1.0109 1.0193 0.9909 1.0051 1.0096 0.9929 0.9945 0.9994 1.0056 1.0079 1.0078 1.0003 0.9985 0.9951 0.9967 0.9937 0.9947 0.9960 0.9898 0.9928
dispcorr: -0.023422046 hartree
energy: -940.013740916013
dipole: 2.72476 -1.22565 1.49911 0.61139 -1.26297 -0.65158 -3.24000 2.29136 -0.94864
magnitude: 1.88992 au
magnitude: 4.80380 debye
