program: Orca
programVersion: 4.2.1
elementType: O O O O N C C C C C C C C C C C C C C C H H H H H H H H H H H H H H H H H H H H H
charge: 0
multiplicity: 1
keywords: wb97x-d3
keywords: def2-TZVPP
keywords: def2/J RIJCOSX GRIDX6 NOFINALGRIDX
keywords: grid4 nofinalgrid
keywords: scfconv7
keywords: smallprint printgap noloewdin
keywords: NOSOSCF
formula: C15H21NO4
InChI: InChI=1/C15H21NO4/c1-10-7-6-8-11(2)14(10)16(13(17)9-19-4)12(3)15(18)20-5/h6-8,12H,9H2,1-5H3
41 atoms
O  -3.409924 -1.295777 -0.089608
O  0.85988 2.628133 -1.606941
O  -1.789305 1.33565 -0.693068
O  -2.373723 -0.466906 1.707662
N  -0.135393 -0.039059 -0.04914
C  -1.067695 -1.153174 -0.208414
C  1.244828 -0.279599 0.214984
C  1.727197 -0.168587 1.521678
C  2.081362 -0.645262 -0.844259
C  -0.489437 -2.480032 0.271655
C  -0.62778 1.192325 -0.361156
C  -2.342993 -0.886392 0.584445
C  3.071455 -0.444259 1.753405
C  3.416348 -0.917486 -0.571189
C  0.845136 0.279671 2.647971
C  1.561337 -0.731422 -2.248273
C  3.909383 -0.820979 0.719076
C  0.326045 2.382142 -0.334638
C  -4.666965 -1.135287 0.55216
C  -0.024855 3.242846 -2.511288
H  -1.342802 -1.246811 -1.263146
H  -0.215543 -2.444249 1.325154
H  -1.236599 -3.262777 0.14084
H  0.392337 -2.770116 -0.297291
H  3.460705 -0.363147 2.760696
H  4.075485 -1.203552 -1.381316
H  0.66928 1.357934 2.604611
H  -0.135815 -0.189448 2.630502
H  1.311931 0.072025 3.609717
H  2.3530 -1.023481 -2.936437
H  0.757847 -1.46302 -2.351005
H  1.172604 0.230812 -2.580345
H  4.9511 -1.036628 0.917529
H  -0.247006 3.242044 0.035974
H  1.172899 2.224683 0.333158
H  -4.868965 -0.085726 0.765498
H  -4.721603 -1.699928 1.483484
H  -5.409847 -1.512689 -0.145306
H  -0.831687 2.583079 -2.841263
H  0.562202 3.537008 -3.380342
H  -0.482579 4.142037 -2.082026
totalener: -939.99199843 hartree
nucrepener: 1714.30790831 hartree
electener: -2654.29990675 hartree
oneelecener: -4686.62235455 hartree
twoeener: 2032.32244780 hartree
kineticenergy: 935.94834248 hartree
xcener: -90.038286293562 hartree
chargesum: 0.0000000
charge: -0.266294 -0.330159 -0.403877 -0.379055 0.019850 0.031414 0.124151 -0.222549 -0.228207 -0.274523 0.261884 0.384547 -0.004069 -0.005811 -0.241894 -0.255083 -0.167180 0.029711 -0.135282 -0.118315 0.087703 0.112516 0.109891 0.104396 0.108438 0.106912 0.085585 0.125073 0.085504 0.086248 0.088518 0.113330 0.125203 0.101240 0.103204 0.117593 0.106526 0.116132 0.101754 0.108657 0.086320
qa: -0.2663 -0.3302 -0.4039 -0.3791 0.0198 0.0314 0.1242 -0.2225 -0.2282 -0.2745 0.2619 0.3845 -0.0041 -0.0058 -0.2419 -0.2551 -0.1672 0.0297 -0.1353 -0.1183 0.0877 0.1125 0.1099 0.1044 0.1084 0.1069 0.0856 0.1251 0.0855 0.0862 0.0885 0.1133 0.1252 0.1012 0.1032 0.1176 0.1065 0.1161 0.1018 0.1087 0.0863
va: 2.1415 1.9744 2.1069 2.1178 2.9256 3.9015 3.4306 3.9401 3.9692 3.9326 4.0484 4.1704 3.8203 3.8392 3.9484 3.9550 4.0411 3.8944 3.9017 3.9124 1.0314 1.0001 1.0113 0.9996 1.0094 1.0091 0.9961 1.0214 1.0060 1.0099 0.9954 1.0090 1.0011 1.0062 0.9953 0.9943 0.9945 0.9948 0.9895 0.9898 0.9998
dispcorr: -0.023325000 hartree
energy: -940.015323434678
dipole: 1.21828 -0.77451 0.44378 -1.03091 0.42357 -0.60734 -2.49602 2.27086 -0.22516
magnitude: 0.78518 au
magnitude: 1.99576 debye
