program: Orca
programVersion: 4.2.1
elementType: O O O O N C C C C C C C C C C C C C C C H H H H H H H H H H H H H H H H H H H H H
charge: 0
multiplicity: 1
keywords: wb97x-d3
keywords: def2-TZVPP
keywords: def2/J RIJCOSX GRIDX6 NOFINALGRIDX
keywords: grid4 nofinalgrid
keywords: scfconv7
keywords: smallprint printgap noloewdin
keywords: NOSOSCF
formula: C15H21NO4
InChI: InChI=1/C15H21NO4/c1-10-7-6-8-11(2)14(10)16(13(17)9-19-4)12(3)15(18)20-5/h6-8,12H,9H2,1-5H3
41 atoms
O  -2.419841 -0.951568 -1.123435
O  0.350465 2.134235 -1.304404
O  -2.125348 1.173033 0.802241
O  -3.329667 -1.870896 0.696412
N  -0.296547 -0.065977 0.356557
C  -0.996096 -1.288536 0.741019
C  1.116307 -0.140702 0.193968
C  1.966639 0.264444 1.226601
C  1.632247 -0.662729 -1.00237
C  -1.035701 -1.522482 2.243577
C  -0.98002 1.111716 0.407167
C  -2.394486 -1.376468 0.134521
C  3.344456 0.142002 1.042251
C  3.007249 -0.776958 -1.140095
C  1.48558 0.844714 2.528092
C  0.731495 -1.060315 -2.131376
C  3.86388 -0.378406 -0.124696
C  -0.241992 2.358696 -0.060586
C  -3.686703 -0.946505 -1.764466
C  1.554181 2.82151 -1.504771
H  -0.429311 -2.110937 0.289614
H  -1.50915 -2.476178 2.467282
H  -0.022948 -1.5536 2.643738
H  -1.597717 -0.741976 2.752781
H  4.010266 0.455187 1.837764
H  3.413594 -1.175287 -2.061559
H  0.405726 0.830826 2.644175
H  1.90647 0.293646 3.370104
H  1.814896 1.880383 2.634842
H  1.314419 -1.262225 -3.029001
H  0.160205 -1.963455 -1.910514
H  0.013073 -0.27538 -2.356526
H  4.934705 -0.472711 -0.249018
H  -0.977072 3.170123 -0.101517
H  0.499802 2.637777 0.70173
H  -3.515784 -0.550059 -2.761745
H  -4.392289 -0.306074 -1.235287
H  -4.107719 -1.949592 -1.838197
H  2.308937 2.546506 -0.757674
H  1.423232 3.910383 -1.482723
H  1.931624 2.543287 -2.487449
totalener: -939.98869148 hartree
nucrepener: 1746.06240174 hartree
electener: -2686.05109322 hartree
oneelecener: -4749.92486097 hartree
twoeener: 2063.87376775 hartree
kineticenergy: 935.95832576 hartree
xcener: -90.041726144118 hartree
chargesum: -0.0000000
charge: -0.262402 -0.308306 -0.383486 -0.350515 0.058166 0.078050 0.149302 -0.211277 -0.164034 -0.316251 0.254317 0.371330 -0.074368 -0.029615 -0.347124 -0.236141 -0.144322 -0.049645 -0.137184 -0.115430 0.086489 0.112525 0.097738 0.110660 0.111039 0.107396 0.115748 0.117288 0.110469 0.083530 0.084125 0.112480 0.126551 0.108567 0.099029 0.106983 0.121030 0.110574 0.081616 0.106835 0.108264
qa: -0.2624 -0.3083 -0.3835 -0.3505 0.0582 0.0781 0.1493 -0.2113 -0.1640 -0.3163 0.2543 0.3713 -0.0744 -0.0296 -0.3471 -0.2361 -0.1443 -0.0496 -0.1372 -0.1154 0.0865 0.1125 0.0977 0.1107 0.1110 0.1074 0.1157 0.1173 0.1105 0.0835 0.0841 0.1125 0.1266 0.1086 0.0990 0.1070 0.1210 0.1106 0.0816 0.1068 0.1083
va: 2.1222 1.9646 2.1242 2.1661 2.8850 3.8112 3.5149 3.8157 3.9314 3.9689 4.1442 4.1778 3.8867 3.8321 3.9474 3.9410 4.0086 3.9852 3.9011 3.9086 1.0042 1.0197 0.9903 1.0120 1.0067 1.0101 1.0014 0.9943 0.9931 1.0078 1.0064 1.0189 1.0001 1.0155 0.9807 0.9945 0.9958 0.9942 0.9834 0.9913 0.9944
dispcorr: -0.024946096 hartree
energy: -940.013637577217
dipole: 7.31329 -5.51821 1.79508 3.01566 -2.66867 0.34699 -0.78914 0.22279 -0.56636
magnitude: 1.91402 au
magnitude: 4.86506 debye
