program: Orca
programVersion: 5.0.2
elementType: C C C C C C C N C F H H F C O H C H H H C C F C H C H C H C C C C H H H H H H O H
charge: 0
multiplicity: 1
keywords: wb97x-d3
keywords: def2-TZVPP
keywords: def2/J RIJCOSX
keywords: DEFGRID2
keywords: scfconv7
keywords: smallprint printgap noloewdin
keywords: NOSOSCF
formula: C19H16F3NO2
InChI: InChI=1/C19H16F3NO2/c1-10-15(9-11-7-8-13(21)17(22)18(11)23-10)25-14-6-4-5-12(20)16(14)19(2,3)24/h4-9,24H,1-3H3
41 atoms
C  4.537668 -0.886289 0.866056
C  3.670583 -1.950146 1.135283
C  2.351397 -1.85061 0.784489
C  1.866361 -0.687646 0.151988
C  4.091987 0.255474 0.264253
C  2.741989 0.386889 -0.114987
C  0.140341 0.619266 -0.856058
N  2.34117 1.526222 -0.720807
C  0.518136 -0.536723 -0.24118
F  5.827325 -0.991394 1.204598
H  4.057687 -2.838015 1.617451
H  1.672235 -2.667486 0.988909
F  4.935889 1.259186 0.027058
C  1.096011 1.655266 -1.085865
O  -1.117587 0.897812 -1.281032
H  -0.178456 -1.342807 -0.048221
C  0.669947 2.917383 -1.759435
H  -0.09095 3.440989 -1.17721
H  0.239933 2.719498 -2.742577
H  1.521225 3.581728 -1.884659
C  -2.90835 -0.133102 -0.03196
C  -3.784843 -1.224564 -0.02659
F  -4.567033 -1.445293 1.040166
C  -3.895192 -2.14239 -1.050774
H  -4.61143 -2.94939 -0.969894
C  -3.081618 -2.010134 -2.162091
H  -3.156594 -2.714539 -2.978727
C  -2.158163 -0.984522 -2.206212
H  -1.491104 -0.872531 -3.051004
C  -2.077089 -0.080529 -1.155639
C  -2.933358 0.866281 1.140287
C  -2.27521 0.226292 2.36022
C  -2.264167 2.217235 0.877171
H  -2.293945 0.91754 3.20484
H  -1.232828 -0.005775 2.142905
H  -2.767378 -0.695905 2.666392
H  -1.179613 2.165415 0.834295
H  -2.511905 2.867454 1.71748
H  -2.633653 2.695568 -0.030901
O  -4.287951 1.12766 1.481665
H  -4.669791 1.676303 0.786442
elementType: C N F H O
totalener: -1238.50945724 hartree
nucrepener: 2216.62191727 hartree
electener: -3455.13137451 hartree
oneelecener: -6099.84249590 hartree
twoeener: 2644.71112139 hartree
cpcmener: -0.03367634 hartree
kineticenergy: 1233.53886672 hartree
xcener: -114.399291493124 hartree
chargesum: -0.0000000
charge: 0.234156 -0.176864 -0.170718 -0.002689 0.135058 0.095544 0.226940 -0.365913 -0.065500 -0.213065 0.155752 0.153552 -0.201718 0.120360 -0.331926 0.142768 -0.260409 0.106920 0.106618 0.098729 -0.199773 0.271090 -0.213841 -0.234364 0.148349 -0.118395 0.165361 -0.158688 0.153923 0.199346 0.442844 -0.308448 -0.343525 0.103908 0.097448 0.104778 0.088258 0.108710 0.117880 -0.437120 0.224663
qa: 0.2342 -0.1769 -0.1707 -0.0027 0.1351 0.0955 0.2269 -0.3659 -0.0655 -0.2131 0.1558 0.1536 -0.2017 0.1204 -0.3319 0.1428 -0.2604 0.1069 0.1066 0.0987 -0.1998 0.2711 -0.2138 -0.2344 0.1483 -0.1184 0.1654 -0.1587 0.1539 0.1993 0.4428 -0.3084 -0.3435 0.1039 0.0974 0.1048 0.0883 0.1087 0.1179 -0.4371 0.2247
va: 3.9170 3.8984 3.8807 3.8139 4.0796 3.7198 3.7280 3.0725 3.7960 1.0715 0.9964 1.0032 1.0923 3.9345 2.0578 1.0092 3.9019 0.9974 0.9998 1.0214 3.7031 3.9526 1.0648 3.9431 1.0021 3.8625 0.9864 3.9771 0.9995 3.6607 3.6930 3.8958 3.9814 1.0081 0.9989 1.0161 0.9976 1.0139 0.9980 1.9798 1.0058
dispcorr: -0.022180206 hartree
energy: -1238.531637449770
dipole: -23.94611 22.36429 -1.58182 6.83347 -7.99005 -1.15657 -1.09658 0.07107 -1.02551
magnitude: 2.21167 au
magnitude: 5.62162 debye
