program: Orca
programVersion: 5.0.2
elementType: C C C C C C C N C F H H F C O H C H H H C C F C H C H C H C C C C H H H H H H O H
charge: 0
multiplicity: 1
keywords: wb97x-d3
keywords: def2-TZVPP
keywords: def2/J RIJCOSX
keywords: DEFGRID2
keywords: scfconv7
keywords: smallprint printgap noloewdin
keywords: NOSOSCF
formula: C19H16F3NO2
InChI: InChI=1/C19H16F3NO2/c1-10-15(9-11-7-8-13(21)17(22)18(11)23-10)25-14-6-4-5-12(20)16(14)19(2,3)24/h4-9,24H,1-3H3
41 atoms
C  4.592535 -0.895245 0.867638
C  3.732645 -1.962923 1.145011
C  2.40652 -1.862696 0.822218
C  1.906442 -0.695077 0.210286
C  4.133423 0.249693 0.282833
C  2.775641 0.382445 -0.066795
C  0.160763 0.616672 -0.755836
N  2.361636 1.526628 -0.65342
C  0.55011 -0.541747 -0.152799
F  5.888715 -1.000019 1.180149
H  4.130658 -2.854462 1.611077
H  1.733301 -2.683117 1.031913
F  4.97103 1.255915 0.034214
C  1.109487 1.656981 -0.993127
O  -1.102764 0.896751 -1.159257
H  -0.143691 -1.348312 0.048492
C  0.669109 2.926217 -1.644035
H  -0.091551 3.435558 -1.049189
H  0.234335 2.740429 -2.627555
H  1.515039 3.598107 -1.764416
C  -2.992005 -0.103137 -0.0453
C  -3.89431 -1.172041 -0.104066
F  -4.799319 -1.333568 0.87231
C  -3.912597 -2.12347 -1.102544
H  -4.651539 -2.913409 -1.074589
C  -2.978359 -2.045873 -2.12045
H  -2.976949 -2.778897 -2.915108
C  -2.0432 -1.030948 -2.105959
H  -1.295709 -0.953898 -2.884972
C  -2.057215 -0.089352 -1.085014
C  -3.075512 0.895642 1.115786
C  -2.576402 0.209753 2.392235
C  -2.303831 2.206258 0.946656
H  -1.532651 -0.085359 2.283596
H  -3.152726 -0.67869 2.644914
H  -2.636539 0.900196 3.236319
H  -2.595773 2.86061 1.771774
H  -2.546049 2.72156 0.018245
H  -1.225534 2.086576 1.021577
O  -4.456469 1.229625 1.210088
H  -4.559847 1.815412 1.968835
elementType: C N F H O
totalener: -1238.50893208 hartree
nucrepener: 2208.54789984 hartree
electener: -3447.05683192 hartree
oneelecener: -6084.03173672 hartree
twoeener: 2636.97490480 hartree
cpcmener: -0.03475895 hartree
kineticenergy: 1233.54194520 hartree
xcener: -114.399624408045 hartree
chargesum: 0.0000000
charge: 0.234120 -0.176215 -0.170083 -0.005391 0.134316 0.097582 0.216385 -0.365919 -0.046460 -0.213084 0.155680 0.153525 -0.201653 0.116745 -0.327510 0.142744 -0.264308 0.107912 0.106915 0.098857 -0.141534 0.266407 -0.214829 -0.235638 0.148667 -0.114137 0.165339 -0.161839 0.156013 0.236578 0.378454 -0.330075 -0.348024 0.095908 0.104428 0.106542 0.107689 0.111973 0.088682 -0.445645 0.230882
qa: 0.2341 -0.1762 -0.1701 -0.0054 0.1343 0.0976 0.2164 -0.3659 -0.0465 -0.2131 0.1557 0.1535 -0.2017 0.1167 -0.3275 0.1427 -0.2643 0.1079 0.1069 0.0989 -0.1415 0.2664 -0.2148 -0.2356 0.1487 -0.1141 0.1653 -0.1618 0.1560 0.2366 0.3785 -0.3301 -0.3480 0.0959 0.1044 0.1065 0.1077 0.1120 0.0887 -0.4456 0.2309
va: 3.9172 3.8972 3.8805 3.8232 4.0803 3.7163 3.7309 3.0720 3.7976 1.0715 0.9963 1.0031 1.0924 3.9390 2.0588 1.0089 3.9022 0.9967 0.9996 1.0215 3.5981 3.9492 1.0655 3.9482 1.0016 3.8639 0.9864 3.9747 0.9980 3.6084 3.7625 3.9548 3.9932 1.0016 1.0122 1.0014 1.0070 1.0037 0.9954 1.9696 1.0058
dispcorr: -0.021796337 hartree
energy: -1238.530728415475
dipole: -24.03392 22.76794 -1.26598 6.52920 -7.75394 -1.22474 0.97083 -0.69526 0.27557
magnitude: 1.78288 au
magnitude: 4.53171 debye
