program: Orca
programVersion: 5.0.2
elementType: C C C C C C C N C F H H F C O H C H H H C C F C H C H C H C C C C H H H H H H O H
charge: 0
multiplicity: 1
keywords: wb97x-d3
keywords: def2-TZVPP
keywords: def2/J RIJCOSX
keywords: DEFGRID2
keywords: scfconv7
keywords: smallprint printgap noloewdin
keywords: NOSOSCF
formula: C19H16F3NO2
InChI: InChI=1/C19H16F3NO2/c1-10-15(9-11-7-8-13(21)17(22)18(11)23-10)25-14-6-4-5-12(20)16(14)19(2,3)24/h4-9,24H,1-3H3
41 atoms
C  5.114235 -0.733372 0.324119
C  4.537165 -1.51534 1.331021
C  3.190079 -1.435567 1.552918
C  2.390576 -0.57089 0.777935
C  4.363422 0.110856 -0.441942
C  2.973973 0.2241 -0.235541
C  0.310079 0.413937 0.165402
N  2.267306 1.081161 -1.003657
C  0.997433 -0.449288 0.958366
F  6.429246 -0.815525 0.105599
H  5.165839 -2.172934 1.916465
H  2.728038 -2.037273 2.324031
F  4.946925 0.835571 -1.395175
C  0.97721 1.18786 -0.822135
O  -1.035439 0.596454 0.344341
H  0.491669 -1.034723 1.716893
C  0.204441 2.148665 -1.663028
H  0.865176 2.650539 -2.365366
H  -0.283541 2.906675 -1.047507
H  -0.578956 1.644351 -2.23187
C  -3.279833 -0.076698 0.08352
C  -4.16659 -0.84453 -0.663266
F  -5.486332 -0.766081 -0.430282
C  -3.793884 -1.716337 -1.671541
H  -4.549579 -2.284653 -2.196905
C  -2.455005 -1.83394 -1.982213
H  -2.135511 -2.509375 -2.763683
C  -1.516111 -1.076372 -1.302067
H  -0.470366 -1.164496 -1.563057
C  -1.932436 -0.208047 -0.304287
C  -3.673107 0.880155 1.228845
C  -3.605782 2.321722 0.718528
C  -5.061867 0.643994 1.819898
H  -2.61395 2.598084 0.359884
H  -3.879869 3.015074 1.516119
H  -4.306202 2.466459 -0.10432
H  -5.859316 0.937247 1.143851
H  -5.151202 1.269538 2.709084
H  -5.217641 -0.390708 2.126028
O  -2.806714 0.679454 2.337519
H  -1.911675 0.931318 2.084098
elementType: C N F H O
totalener: -1238.51160265 hartree
nucrepener: 2182.02368343 hartree
electener: -3420.53528608 hartree
oneelecener: -6030.34598939 hartree
twoeener: 2609.81070330 hartree
cpcmener: -0.03064713 hartree
kineticenergy: 1233.54214032 hartree
xcener: -114.401906469836 hartree
chargesum: -0.0000000
charge: 0.236960 -0.159381 -0.164033 0.019201 0.123675 0.144480 0.161950 -0.361469 -0.054978 -0.209228 0.157165 0.156385 -0.200608 0.136562 -0.344273 0.150033 -0.271315 0.103413 0.112513 0.111987 -0.330585 0.356396 -0.222277 -0.238976 0.146931 -0.120656 0.163831 -0.245000 0.150111 0.339910 0.402380 -0.311659 -0.312540 0.104006 0.105182 0.098625 0.088094 0.094921 0.114197 -0.468588 0.236659
qa: 0.2370 -0.1594 -0.1640 0.0192 0.1237 0.1445 0.1619 -0.3615 -0.0550 -0.2092 0.1572 0.1564 -0.2006 0.1366 -0.3443 0.1500 -0.2713 0.1034 0.1125 0.1120 -0.3306 0.3564 -0.2223 -0.2390 0.1469 -0.1207 0.1638 -0.2450 0.1501 0.3399 0.4024 -0.3117 -0.3125 0.1040 0.1052 0.0986 0.0881 0.0949 0.1142 -0.4686 0.2367
va: 3.9217 3.8886 3.8815 3.7547 4.0759 3.7028 3.7941 3.0775 4.0000 1.0778 0.9949 1.0008 1.0944 3.9758 2.0154 1.0107 3.9091 1.0228 0.9959 0.9968 3.7497 3.7963 1.0642 3.9734 1.0019 3.8833 0.9871 3.9268 1.0036 3.6397 3.7538 3.9375 3.8834 1.0075 1.0042 1.0063 1.0110 1.0150 1.0067 1.9656 1.0273
dispcorr: -0.021098428 hartree
energy: -1238.532701081233
dipole: -31.53422 31.02171 -0.51250 7.19385 -8.02904 -0.83519 5.08666 -4.95223 0.13443
magnitude: 0.98907 au
magnitude: 2.51402 debye
