program: Orca
programVersion: 5.0.2
elementType: C C C C C C C N C F H H F C O H C H H H C C F C H C H C H C C C C H H H H H H O H
charge: 0
multiplicity: 1
keywords: wb97x-d3
keywords: def2-TZVPP
keywords: def2/J RIJCOSX
keywords: DEFGRID2
keywords: scfconv7
keywords: smallprint printgap noloewdin
keywords: NOSOSCF
formula: C19H16F3NO2
InChI: InChI=1/C19H16F3NO2/c1-10-15(9-11-7-8-13(21)17(22)18(11)23-10)25-14-6-4-5-12(20)16(14)19(2,3)24/h4-9,24H,1-3H3
41 atoms
C  4.677669 -0.578961 -0.946342
C  3.863482 -1.575517 -1.49479
C  2.525452 -1.593966 -1.203997
C  1.965881 -0.621054 -0.350794
C  4.161686 0.378353 -0.121232
C  2.791161 0.382409 0.20294
C  0.152747 0.373737 0.844891
N  2.322748 1.341923 1.028076
C  0.595817 -0.593838 -0.005784
F  5.983571 -0.56383 -1.235742
H  4.30624 -2.319723 -2.144184
H  1.890773 -2.362391 -1.625929
F  4.951109 1.322947 0.387421
C  1.060894 1.35454 1.349436
O  -1.120299 0.509808 1.279481
H  -0.067332 -1.345398 -0.416722
C  0.566312 2.426873 2.264504
H  -0.213788 3.030091 1.792248
H  1.387351 3.085495 2.541604
H  0.136287 2.008512 3.178161
C  -3.026584 -0.153147 -0.044599
C  -4.013918 -1.135291 -0.158799
F  -5.028427 -0.949758 -1.022507
C  -4.041853 -2.312381 0.558999
H  -4.842164 -3.022154 0.393643
C  -3.042849 -2.550131 1.487302
H  -3.041494 -3.465246 2.063688
C  -2.061756 -1.59864 1.684571
H  -1.289524 -1.747192 2.429012
C  -2.068545 -0.424817 0.940095
C  -3.052808 1.100764 -0.944286
C  -3.030196 0.696328 -2.419624
C  -4.279183 1.956069 -0.616316
H  -3.901206 0.122631 -2.719718
H  -2.140651 0.105932 -2.646303
H  -3.003544 1.595222 -3.037966
H  -5.218823 1.4367 -0.78948
H  -4.277691 2.853113 -1.238312
H  -4.264639 2.270635 0.429988
O  -1.891199 1.88915 -0.797551
H  -1.927732 2.361028 0.040883
elementType: C N F H O
totalener: -1238.51999156 hartree
nucrepener: 2204.44447509 hartree
electener: -3442.96446665 hartree
oneelecener: -6076.00068746 hartree
twoeener: 2633.03622081 hartree
cpcmener: -0.02649027 hartree
kineticenergy: 1233.52477301 hartree
xcener: -114.396056956873 hartree
chargesum: 0.0000000
charge: 0.231975 -0.173759 -0.167029 -0.008745 0.134988 0.100000 0.246690 -0.356600 -0.063822 -0.211460 0.152527 0.149374 -0.198445 0.114210 -0.326648 0.135848 -0.264527 0.102269 0.101057 0.103699 -0.171930 0.295242 -0.225199 -0.214385 0.148394 -0.125598 0.161136 -0.156318 0.152825 0.178435 0.365344 -0.305066 -0.318117 0.095632 0.106109 0.098494 0.094924 0.104259 0.108167 -0.412984 0.219033
qa: 0.2320 -0.1738 -0.1670 -0.0087 0.1350 0.1000 0.2467 -0.3566 -0.0638 -0.2115 0.1525 0.1494 -0.1984 0.1142 -0.3266 0.1358 -0.2645 0.1023 0.1011 0.1037 -0.1719 0.2952 -0.2252 -0.2144 0.1484 -0.1256 0.1611 -0.1563 0.1528 0.1784 0.3653 -0.3051 -0.3181 0.0956 0.1061 0.0985 0.0949 0.1043 0.1082 -0.4130 0.2190
va: 3.9225 3.9006 3.8841 3.8311 4.0792 3.7174 3.7190 3.0724 3.8695 1.0737 0.9974 1.0044 1.0973 3.9449 2.0589 1.0129 3.9051 0.9993 1.0207 0.9992 3.6526 3.8487 1.0598 3.9653 1.0017 3.8892 0.9878 3.9645 0.9984 3.7244 3.8093 3.8992 3.9347 1.0183 1.0067 1.0112 1.0187 1.0066 1.0001 2.0119 1.0145
dispcorr: -0.021140084 hartree
energy: -1238.541131639583
dipole: -30.14968 27.64417 -2.50551 4.38207 -5.88718 -1.50511 0.20627 0.16767 0.37394
magnitude: 2.94666 au
magnitude: 7.48981 debye
