program: Orca
programVersion: 5.0.2
elementType: C C C C C C C N C F H H F C O H C H H H C C F C H C H C H C C C C H H H H H H O H
charge: 0
multiplicity: 1
keywords: wb97x-d3
keywords: def2-TZVPP
keywords: def2/J RIJCOSX
keywords: DEFGRID2
keywords: scfconv7
keywords: smallprint printgap noloewdin
keywords: NOSOSCF
formula: C19H16F3NO2
InChI: InChI=1/C19H16F3NO2/c1-10-15(9-11-7-8-13(21)17(22)18(11)23-10)25-14-6-4-5-12(20)16(14)19(2,3)24/h4-9,24H,1-3H3
41 atoms
C  4.541401 -0.878222 0.868363
C  3.67527 -1.942899 1.139901
C  2.356097 -1.849015 0.787709
C  1.868082 -0.689392 0.151113
C  4.093833 0.259863 0.260949
C  2.743028 0.385101 -0.119223
C  0.1396 0.61832 -0.855262
N  2.342041 1.519638 -0.730761
C  0.519622 -0.538271 -0.241608
F  5.830523 -0.981143 1.208115
H  4.063869 -2.828469 1.625753
H  1.68012 -2.668346 0.994512
F  4.932086 1.265231 0.01664
C  1.097547 1.650968 -1.093765
O  -1.118717 0.89839 -1.271503
H  -0.177175 -1.344359 -0.048841
C  0.679849 2.912645 -1.775058
H  -0.074578 3.449582 -1.196263
H  0.247232 2.714282 -2.757317
H  1.539962 3.56589 -1.903765
C  -2.910166 -0.13439 -0.028567
C  -3.790659 -1.223199 -0.028406
F  -4.576804 -1.445237 1.034309
C  -3.900841 -2.136727 -1.056819
H  -4.619807 -2.942133 -0.980688
C  -3.085065 -2.002265 -2.16621
H  -3.161077 -2.703313 -2.986154
C  -2.15971 -0.978226 -2.205767
H  -1.492761 -0.86399 -3.050752
C  -2.077525 -0.078432 -1.151354
C  -2.936671 0.862977 1.14654
C  -2.283347 0.220397 2.367792
C  -2.263387 2.213052 0.887079
H  -2.305483 0.909754 3.214353
H  -1.239478 -0.012785 2.157246
H  -2.778055 -0.701427 2.671768
H  -1.177836 2.161395 0.860397
H  -2.523391 2.867054 1.721483
H  -2.618257 2.690416 -0.027574
O  -4.289147 1.122334 1.486742
H  -4.678558 1.664633 0.790902
elementType: C N F H O
totalener: -1238.51762430 hartree
nucrepener: 2216.05406391 hartree
electener: -3454.57168821 hartree
oneelecener: -6098.69739195 hartree
twoeener: 2644.12570374 hartree
cpcmener: -0.02817678 hartree
kineticenergy: 1233.53748848 hartree
xcener: -114.397916771546 hartree
chargesum: 0.0000000
charge: 0.232003 -0.174935 -0.169621 -0.001048 0.138354 0.092185 0.217966 -0.356058 -0.068076 -0.210702 0.152581 0.149778 -0.197780 0.117977 -0.322724 0.140502 -0.258758 0.104473 0.104561 0.100919 -0.208259 0.272578 -0.209671 -0.233208 0.146250 -0.115145 0.162165 -0.158546 0.151421 0.198139 0.435355 -0.305805 -0.342936 0.102888 0.094339 0.104851 0.087240 0.109313 0.115875 -0.412198 0.213758
qa: 0.2320 -0.1749 -0.1696 -0.0010 0.1384 0.0922 0.2180 -0.3561 -0.0681 -0.2107 0.1526 0.1498 -0.1978 0.1180 -0.3227 0.1405 -0.2588 0.1045 0.1046 0.1009 -0.2083 0.2726 -0.2097 -0.2332 0.1463 -0.1151 0.1622 -0.1585 0.1514 0.1981 0.4354 -0.3058 -0.3429 0.1029 0.0943 0.1049 0.0872 0.1093 0.1159 -0.4122 0.2138
va: 3.9248 3.9025 3.8853 3.8165 4.0758 3.7290 3.7395 3.0756 3.7956 1.0747 0.9976 1.0045 1.0983 3.9341 2.0655 1.0100 3.9004 0.9979 1.0001 1.0213 3.7098 3.9584 1.0707 3.9475 1.0030 3.8660 0.9876 3.9810 1.0005 3.6645 3.7102 3.8936 3.9854 1.0087 0.9998 1.0163 0.9984 1.0138 0.9979 2.0055 1.0146
dispcorr: -0.022155691 hartree
energy: -1238.539779991599
dipole: -23.91871 22.36325 -1.55546 6.78895 -7.87010 -1.08115 -1.07010 0.09364 -0.97646
magnitude: 2.13115 au
magnitude: 5.41695 debye
