program: Orca
programVersion: 5.0.2
elementType: C C C C C C C N C F H H F C O H C H H H C C F C H C H C H C C C C H H H H H H O H
charge: 0
multiplicity: 1
keywords: wb97x-d3
keywords: def2-TZVPP
keywords: def2/J RIJCOSX
keywords: DEFGRID2
keywords: scfconv7
keywords: smallprint printgap noloewdin
keywords: NOSOSCF
formula: C19H16F3NO2
InChI: InChI=1/C19H16F3NO2/c1-10-15(9-11-7-8-13(21)17(22)18(11)23-10)25-14-6-4-5-12(20)16(14)19(2,3)24/h4-9,24H,1-3H3
41 atoms
C  4.729278 -0.93663 0.704493
C  3.858403 -1.917444 1.191621
C  2.509867 -1.772988 1.013367
C  1.996342 -0.64273 0.345438
C  4.260096 0.169178 0.055859
C  2.876149 0.352923 -0.135025
C  0.213449 0.665278 -0.556478
N  2.446828 1.464807 -0.767387
C  0.617915 -0.449954 0.114458
F  6.045707 -1.089095 0.87661
H  4.267459 -2.780899 1.699806
H  1.829314 -2.529972 1.380701
F  5.109734 1.084663 -0.407415
C  1.171534 1.635494 -0.977007
O  -1.076258 0.955593 -0.853219
H  -0.086658 -1.196362 0.460417
C  0.719252 2.878031 -1.671674
H  1.577905 3.497772 -1.919938
H  0.043744 3.463723 -1.044976
H  0.18132 2.648795 -2.59343
C  -3.080261 -0.076887 -0.025711
C  -3.951872 -1.158709 -0.212991
F  -5.013685 -1.304271 0.591737
C  -3.787987 -2.138007 -1.169959
H  -4.507585 -2.943191 -1.2406
C  -2.701144 -2.064389 -2.024527
H  -2.555803 -2.816843 -2.787577
C  -1.805603 -1.023715 -1.894536
H  -0.953239 -0.945846 -2.557603
C  -1.995456 -0.061196 -0.907486
C  -3.368895 0.939458 1.096685
C  -3.093038 0.273652 2.44439
C  -2.578168 2.247626 1.042046
H  -2.046661 -0.024232 2.508413
H  -3.704664 -0.611947 2.61114
H  -3.28903 0.974279 3.258546
H  -1.520554 2.124236 1.263136
H  -2.989612 2.903633 1.811609
H  -2.681313 2.762157 0.085766
O  -4.747712 1.272496 1.071654
H  -4.920471 1.792373 0.278172
elementType: C N F H O
totalener: -1238.51760449 hartree
nucrepener: 2192.90488797 hartree
electener: -3431.42249245 hartree
oneelecener: -6052.37754888 hartree
twoeener: 2620.95505643 hartree
cpcmener: -0.02832236 hartree
kineticenergy: 1233.54253427 hartree
xcener: -114.398550095108 hartree
chargesum: 0.0000000
charge: 0.232782 -0.170638 -0.167922 -0.005223 0.136394 0.103492 0.188889 -0.355582 -0.023449 -0.210345 0.152882 0.149789 -0.198017 0.115589 -0.325498 0.141781 -0.266674 0.100679 0.104416 0.104689 -0.235720 0.284576 -0.210293 -0.246601 0.145595 -0.106312 0.161740 -0.168986 0.156446 0.229249 0.420361 -0.299637 -0.338895 0.091064 0.103967 0.101532 0.084945 0.107398 0.110194 -0.412080 0.213424
qa: 0.2328 -0.1706 -0.1679 -0.0052 0.1364 0.1035 0.1889 -0.3556 -0.0234 -0.2103 0.1529 0.1498 -0.1980 0.1156 -0.3255 0.1418 -0.2667 0.1007 0.1044 0.1047 -0.2357 0.2846 -0.2103 -0.2466 0.1456 -0.1063 0.1617 -0.1690 0.1564 0.2292 0.4204 -0.2996 -0.3389 0.0911 0.1040 0.1015 0.0849 0.1074 0.1102 -0.4121 0.2134
va: 3.9215 3.8985 3.8878 3.8212 4.0789 3.7189 3.7422 3.0770 3.8176 1.0752 0.9972 1.0044 1.0982 3.9483 2.0428 1.0092 3.9062 1.0210 0.9967 1.0000 3.7013 3.9438 1.0698 3.9612 1.0031 3.8636 0.9877 3.9623 0.9954 3.6505 3.7397 3.8899 3.9982 1.0040 1.0168 1.0083 1.0033 1.0128 0.9991 2.0063 1.0146
dispcorr: -0.021341358 hartree
energy: -1238.538945846464
dipole: -25.63243 24.43174 -1.20070 7.15721 -8.22251 -1.06529 2.12560 -2.61136 -0.48576
magnitude: 1.67705 au
magnitude: 4.26271 debye
