program: Orca
programVersion: 5.0.2
elementType: C C C C C C C N C F H H F C O H C H H H C C F C H C H C H C C C C H H H H H H O H
charge: 0
multiplicity: 1
keywords: wb97x-d3
keywords: def2-TZVPP
keywords: def2/J RIJCOSX
keywords: DEFGRID2
keywords: scfconv7
keywords: smallprint printgap noloewdin
keywords: NOSOSCF
formula: C19H16F3NO2
InChI: InChI=1/C19H16F3NO2/c1-10-15(9-11-7-8-13(21)17(22)18(11)23-10)25-14-6-4-5-12(20)16(14)19(2,3)24/h4-9,24H,1-3H3
41 atoms
C  4.623041 -0.891447 -0.600662
C  3.790528 -1.997213 -0.807219
C  2.453888 -1.900951 -0.52752
C  1.913606 -0.697182 -0.029679
C  4.125819 0.286927 -0.122593
C  2.756413 0.415477 0.180517
C  0.117187 0.666094 0.758745
N  2.308762 1.594509 0.66099
C  0.543209 -0.535381 0.275673
F  5.927341 -0.992917 -0.876371
H  4.218161 -2.915913 -1.187292
H  1.804295 -2.751802 -0.686279
F  4.929332 1.33216 0.063739
C  1.046086 1.734699 0.947593
O  -1.162096 0.967007 1.08084
H  -0.132139 -1.368049 0.122986
C  0.575184 3.046008 1.484568
H  1.418212 3.725333 1.59141
H  0.097788 2.933084 2.459446
H  -0.157492 3.510571 0.821418
C  -2.958697 -0.135878 -0.084539
C  -3.871445 -1.194236 0.003839
F  -4.690246 -1.454905 -1.024442
C  -3.979766 -2.042616 1.086154
H  -4.719587 -2.832349 1.073124
C  -3.136741 -1.862053 2.168502
H  -3.209747 -2.511852 3.029789
C  -2.195452 -0.853019 2.132127
H  -1.517283 -0.697434 2.961322
C  -2.114734 -0.019059 1.023832
C  -2.954793 0.755945 -1.334355
C  -2.183817 2.073657 -1.230764
C  -2.382445 -0.037715 -2.513016
H  -1.103316 1.947733 -1.216342
H  -2.490882 2.676179 -0.376438
H  -2.408588 2.649822 -2.13351
H  -2.416062 0.566767 -3.423703
H  -2.927212 -0.961045 -2.706414
H  -1.337252 -0.294241 -2.332402
O  -4.322366 1.082888 -1.540949
H  -4.385132 1.574157 -2.369626
elementType: C N F H O
totalener: -1238.51697706 hartree
nucrepener: 2211.03557280 hartree
electener: -3449.55254986 hartree
oneelecener: -6088.98679211 hartree
twoeener: 2639.43424225 hartree
cpcmener: -0.02893651 hartree
kineticenergy: 1233.53829602 hartree
xcener: -114.397890036448 hartree
chargesum: -0.0000000
charge: 0.231310 -0.173751 -0.170741 -0.001021 0.138365 0.093853 0.209599 -0.355097 -0.057027 -0.210678 0.152497 0.149689 -0.197594 0.114447 -0.318411 0.140688 -0.261034 0.101298 0.104661 0.105889 -0.138607 0.264116 -0.211475 -0.233668 0.146538 -0.112459 0.161998 -0.158270 0.152198 0.230039 0.370169 -0.348353 -0.325287 0.088441 0.112768 0.104589 0.103872 0.105656 0.093110 -0.423104 0.220787
qa: 0.2313 -0.1738 -0.1707 -0.0010 0.1384 0.0939 0.2096 -0.3551 -0.0570 -0.2107 0.1525 0.1497 -0.1976 0.1144 -0.3184 0.1407 -0.2610 0.1013 0.1047 0.1059 -0.1386 0.2641 -0.2115 -0.2337 0.1465 -0.1125 0.1620 -0.1583 0.1522 0.2300 0.3702 -0.3484 -0.3253 0.0884 0.1128 0.1046 0.1039 0.1057 0.0931 -0.4231 0.2208
va: 3.9250 3.9012 3.8854 3.8229 4.0753 3.7256 3.7483 3.0744 3.7997 1.0747 0.9974 1.0044 1.0985 3.9361 2.0681 1.0100 3.8998 1.0212 1.0000 0.9973 3.5986 3.9586 1.0711 3.9488 1.0025 3.8683 0.9876 3.9793 0.9997 3.6100 3.7774 3.9931 3.9517 0.9957 1.0039 1.0076 1.0024 1.0119 1.0028 1.9933 1.0148
dispcorr: -0.021859426 hartree
energy: -1238.538836484632
dipole: -23.72573 22.46532 -1.26041 5.96601 -7.16701 -1.20101 -2.27449 2.09905 -0.17544
magnitude: 1.74981 au
magnitude: 4.44765 debye
