program: Orca
programVersion: 5.0.2
elementType: C C C C C C C N C F H H F C O H C H H H C C F C H C H C H C C C C H H H H H H O H
charge: 0
multiplicity: 1
keywords: wb97x-d3
keywords: def2-TZVPP
keywords: def2/J RIJCOSX
keywords: DEFGRID2
keywords: scfconv7
keywords: smallprint printgap noloewdin
keywords: NOSOSCF
formula: C19H16F3NO2
InChI: InChI=1/C19H16F3NO2/c1-10-15(9-11-7-8-13(21)17(22)18(11)23-10)25-14-6-4-5-12(20)16(14)19(2,3)24/h4-9,24H,1-3H3
41 atoms
C  4.34394 -0.726168 1.250216
C  3.522765 -1.851611 1.38206
C  2.256018 -1.836032 0.865591
C  1.773094 -0.692385 0.200135
C  3.904077 0.396606 0.605864
C  2.604897 0.440242 0.057962
C  0.088964 0.543577 -0.960926
N  2.209199 1.55908 -0.582077
C  0.472009 -0.607326 -0.34247
F  5.573884 -0.758739 1.765571
H  3.909702 -2.720414 1.897206
H  1.617355 -2.703525 0.968136
F  4.692777 1.454772 0.492902
C  1.009649 1.628226 -1.077978
O  -1.129551 0.752382 -1.51706
H  -0.196598 -1.454171 -0.250385
C  0.608387 2.885137 -1.783403
H  -0.191092 3.400922 -1.248719
H  0.243604 2.687808 -2.791976
H  1.463962 3.552432 -1.841815
C  -2.89857 -0.15675 -0.125985
C  -3.855377 -1.171086 -0.067426
F  -4.639653 -1.269099 1.017697
C  -4.063418 -2.114832 -1.052312
H  -4.834302 -2.861328 -0.918563
C  -3.276604 -2.075859 -2.188467
H  -3.420512 -2.802209 -2.976104
C  -2.298462 -1.107395 -2.301155
H  -1.661944 -1.057672 -3.17439
C  -2.116007 -0.172636 -1.290366
C  -2.760217 0.857013 1.029493
C  -4.09248 1.573847 1.286377
C  -2.257906 0.143323 2.283626
H  -4.458321 2.054969 0.375351
H  -3.934064 2.348641 2.037492
H  -4.878959 0.919022 1.647705
H  -1.285989 -0.31515 2.099323
H  -2.945691 -0.627945 2.619703
H  -2.138035 0.865973 3.091402
O  -1.786065 1.837905 0.763768
H  -2.122757 2.437229 0.091866
totalener: -1238.49713090 hartree
nucrepener: 2232.74677488 hartree
electener: -3471.24390579 hartree
oneelecener: -6132.31550019 hartree
twoeener: 2661.07159440 hartree
kineticenergy: 1233.58621239 hartree
xcener: -114.404135917184 hartree
chargesum: -0.0000000
charge: 0.211369 -0.161050 -0.141210 0.042675 0.152170 0.049801 0.290045 -0.288162 -0.148444 -0.192225 0.123980 0.113774 -0.170199 0.106477 -0.315646 0.117460 -0.266299 0.084688 0.093680 0.112314 -0.193857 0.276181 -0.212639 -0.185863 0.127424 -0.098410 0.132924 -0.135187 0.128058 0.149875 0.378772 -0.313567 -0.288289 0.090643 0.108374 0.098505 0.101936 0.089478 0.098261 -0.336527 0.168713
qa: 0.2114 -0.1611 -0.1412 0.0427 0.1522 0.0498 0.2900 -0.2882 -0.1484 -0.1922 0.1240 0.1138 -0.1702 0.1065 -0.3156 0.1175 -0.2663 0.0847 0.0937 0.1123 -0.1939 0.2762 -0.2126 -0.1859 0.1274 -0.0984 0.1329 -0.1352 0.1281 0.1499 0.3788 -0.3136 -0.2883 0.0906 0.1084 0.0985 0.1019 0.0895 0.0983 -0.3365 0.1687
va: 3.9783 3.9364 3.9143 3.8018 4.0473 3.8148 3.7290 3.1004 3.8891 1.0991 1.0078 1.0148 1.1384 3.9394 2.0889 1.0165 3.8915 1.0045 1.0002 1.0212 3.6842 3.9226 1.0780 3.9954 1.0090 3.9224 0.9978 4.0083 1.0097 3.7943 3.7985 3.9437 3.9105 1.0012 1.0067 1.0223 1.0055 1.0169 1.0125 2.0650 1.0506
dispcorr: -0.022075992 hartree
energy: -1238.519206895554
dipole: -27.89545 25.87506 -2.02039 3.80471 -4.73960 -0.93488 -2.12098 1.52206 -0.59892
magnitude: 2.30537 au
magnitude: 5.85977 debye
