program: Orca
programVersion: 4.2.1
elementType: O O O O N C C C C C C C C C C C C C C C C C H H H H H H H H H H H H H H H H H H H
charge: 0
multiplicity: 1
keywords: wb97x-d3
keywords: def2-TZVPP
keywords: def2/J RIJCOSX GRIDX6 NOFINALGRIDX
keywords: grid4 nofinalgrid
keywords: scfconv7
keywords: smallprint printgap noloewdin
keywords: NOSOSCF
formula: C17H19NO4
InChI: InChI=1/C17H19NO4/c1-11-7-5-8-12(2)15(11)18(13(3)17(20)21-4)16(19)14-9-6-10-22-14/h5-10,13H,1-4H3
41 atoms
O  -3.825354 0.308943 -0.472179
O  0.677009 -3.200569 -0.3651
O  -1.362957 -1.64647 -0.808947
O  -2.645286 -0.03862 1.392044
N  -0.317557 0.260603 -0.258507
C  -1.572451 0.960649 -0.533596
C  0.87591 0.98875 0.013259
C  1.590002 1.521603 -1.063387
C  1.303927 1.139285 1.333642
C  -1.519759 2.434442 -0.15033
C  -0.327739 -1.07389 -0.480866
C  -2.71275 0.321135 0.243815
C  2.76494 2.215961 -0.795653
C  2.487332 1.836151 1.5613
C  1.12805 1.318905 -2.474829
C  0.543542 0.541597 2.476597
C  3.21149 2.370429 0.507604
C  0.906358 -1.860576 -0.318621
C  2.247125 -1.644687 -0.177578
C  2.861653 -2.923384 -0.131991
C  1.856466 -3.824383 -0.246703
C  -5.012462 -0.16654 0.166018
H  -1.802217 0.887847 -1.600148
H  -0.782188 2.976514 -0.739138
H  -2.488672 2.889438 -0.354062
H  -1.294204 2.578365 0.905526
H  3.335593 2.633316 -1.615689
H  2.843504 1.958968 2.576425
H  1.076925 0.260284 -2.735799
H  0.137901 1.74026 -2.65544
H  1.811273 1.794241 -3.175993
H  1.03322 0.768848 3.421877
H  -0.477291 0.917003 2.529602
H  0.476048 -0.544295 2.393041
H  4.129746 2.908805 0.702425
H  2.764427 -0.703298 -0.121588
H  3.912343 -3.136869 -0.027832
H  1.836676 -4.902245 -0.25545
H  -5.274159 0.445977 1.028229
H  -4.907426 -1.205634 0.476166
H  -5.800312 -0.093177 -0.577619
elementType: O N C H
totalener: -1015.00612656 hartree
nucrepener: 1914.60850458 hartree
electener: -2929.61463114 hartree
oneelecener: -5187.98168434 hartree
twoeener: 2258.36705320 hartree
cpcmener: -0.03919723 hartree
kineticenergy: 1010.68468233 hartree
xcener: -97.177480083361 hartree
chargesum: 0.0000000
charge: -0.287903 -0.265151 -0.522471 -0.462676 0.041250 0.049921 0.101000 -0.244985 -0.175211 -0.267313 0.334705 0.414149 -0.044728 -0.056906 -0.239794 -0.243881 -0.182691 0.197294 -0.201819 -0.223938 0.014552 -0.125910 0.101134 0.112128 0.119386 0.114096 0.139981 0.139978 0.105301 0.103513 0.103162 0.101358 0.099420 0.099610 0.161250 0.164104 0.177952 0.183785 0.117423 0.117776 0.131149
qa: -0.2879 -0.2652 -0.5225 -0.4627 0.0413 0.0499 0.1010 -0.2450 -0.1752 -0.2673 0.3347 0.4141 -0.0447 -0.0569 -0.2398 -0.2439 -0.1827 0.1973 -0.2018 -0.2239 0.0146 -0.1259 0.1011 0.1121 0.1194 0.1141 0.1400 0.1400 0.1053 0.1035 0.1032 0.1014 0.0994 0.0996 0.1612 0.1641 0.1780 0.1838 0.1174 0.1178 0.1311
va: 2.1337 2.2896 1.9896 2.0326 3.0269 3.8302 3.2757 3.8886 3.8648 3.9415 4.1948 4.1482 3.7978 3.7945 3.9529 3.9483 3.9537 3.3731 3.9233 3.9358 3.9149 3.8632 1.0343 0.9982 1.0101 0.9975 1.0022 1.0020 0.9972 0.9972 1.0048 1.0068 1.0133 0.9969 0.9893 1.0031 0.9923 0.9858 0.9928 0.9930 0.9950
dispcorr: -0.023836868 hartree
energy: -1015.029963432447
dipole: -0.16051 1.78460 1.62409 11.79415 -10.14707 1.64709 0.65537 -1.07098 -0.41561
magnitude: 2.35017 au
magnitude: 5.97366 debye
