program: Orca
programVersion: 4.2.1
elementType: O O O O N C C C C C C C C C C C C C C C C C H H H H H H H H H H H H H H H H H H H
charge: 0
multiplicity: 1
keywords: wb97x-d3
keywords: def2-TZVPP
keywords: def2/J RIJCOSX GRIDX6 NOFINALGRIDX
keywords: grid4 nofinalgrid
keywords: scfconv7
keywords: smallprint printgap noloewdin
keywords: NOSOSCF
formula: C17H19NO4
InChI: InChI=1/C17H19NO4/c1-11-7-5-8-12(2)15(11)18(13(3)17(20)21-4)16(19)14-9-6-10-22-14/h5-10,13H,1-4H3
41 atoms
O  -3.835655 0.328179 -0.523625
O  2.010449 -1.526572 -0.218904
O  -1.498569 -1.649574 -0.716777
O  -2.727457 0.075317 1.397294
N  -0.347644 0.220079 -0.25271
C  -1.576063 0.968305 -0.532764
C  0.867048 0.916284 0.024249
C  1.571061 1.47792 -1.043811
C  1.317714 1.019513 1.340643
C  -1.482326 2.43359 -0.125501
C  -0.429468 -1.120802 -0.43055
C  -2.7494 0.366717 0.228995
C  2.742205 2.174653 -0.769406
C  2.496501 1.722072 1.575666
C  1.091545 1.321981 -2.455784
C  0.596372 0.357232 2.473897
C  3.201338 2.298594 0.532545
C  0.742976 -1.989841 -0.267438
C  0.746895 -3.347853 -0.159674
C  2.105492 -3.732968 -0.02717
C  2.822668 -2.582444 -0.075726
C  -5.043356 -0.112919 0.094921
H  -1.796992 0.913117 -1.602387
H  -1.263207 2.550894 0.935342
H  -0.725775 2.970325 -0.69474
H  -2.437308 2.919373 -0.327924
H  3.301652 2.618513 -1.583887
H  2.863399 1.816993 2.590549
H  0.906315 0.277545 -2.713269
H  0.163062 1.866645 -2.642334
H  1.829255 1.705014 -3.159678
H  0.935068 0.750486 3.431767
H  -0.482905 0.485127 2.416609
H  0.785963 -0.719535 2.485847
H  4.11443 2.844396 0.733613
H  -0.117642 -3.991275 -0.165502
H  2.496895 -4.730406 0.086871
H  3.879655 -2.374234 -0.02668
H  -4.95589 -1.1385 0.453947
H  -5.80749 -0.069457 -0.676328
H  -5.331174 0.536549 0.921798
elementType: O N C H
totalener: -1015.01142241 hartree
nucrepener: 1922.61395703 hartree
electener: -2937.62537944 hartree
oneelecener: -5203.98574226 hartree
twoeener: 2266.36036282 hartree
cpcmener: -0.02832926 hartree
kineticenergy: 1010.69384470 hartree
xcener: -97.175185719611 hartree
chargesum: 0.0000000
charge: -0.281898 -0.245011 -0.495254 -0.448866 0.038960 0.054230 0.145051 -0.246753 -0.147015 -0.278463 0.376543 0.411645 -0.066263 -0.071323 -0.243195 -0.267280 -0.183240 0.177410 -0.252773 -0.177488 -0.032559 -0.125893 0.096669 0.113215 0.110432 0.118916 0.136584 0.135936 0.107979 0.096821 0.100847 0.100413 0.108919 0.102227 0.156911 0.167761 0.174162 0.172603 0.115825 0.128741 0.114475
qa: -0.2819 -0.2450 -0.4953 -0.4489 0.0390 0.0542 0.1451 -0.2468 -0.1470 -0.2785 0.3765 0.4116 -0.0663 -0.0713 -0.2432 -0.2673 -0.1832 0.1774 -0.2528 -0.1775 -0.0326 -0.1259 0.0967 0.1132 0.1104 0.1189 0.1366 0.1359 0.1080 0.0968 0.1008 0.1004 0.1089 0.1022 0.1569 0.1678 0.1742 0.1726 0.1158 0.1287 0.1145
va: 2.1348 2.2996 2.0289 2.0504 3.0104 3.8195 3.3054 3.9126 3.8693 3.9462 4.1218 4.1647 3.8166 3.8134 3.9502 3.9271 3.9544 3.3925 4.0244 3.9287 3.9295 3.8714 1.0334 0.9988 0.9990 1.0091 1.0023 1.0024 0.9979 0.9957 1.0055 1.0056 1.0197 0.9933 0.9900 1.0137 0.9930 0.9916 0.9939 0.9948 0.9933
dispcorr: -0.023804066 hartree
energy: -1015.035226473289
dipole: -1.93025 3.15400 1.22374 8.97175 -8.10418 0.86757 0.40077 -0.89652 -0.49574
magnitude: 1.57987 au
magnitude: 4.01571 debye
