program: Orca
programVersion: 4.2.1
elementType: O O O O N C C C C C C C C C C C C C C C C C H H H H H H H H H H H H H H H H H H H
charge: 0
multiplicity: 1
keywords: wb97x-d3
keywords: def2-TZVPP
keywords: def2/J RIJCOSX GRIDX6 NOFINALGRIDX
keywords: grid4 nofinalgrid
keywords: scfconv7
keywords: smallprint printgap noloewdin
keywords: NOSOSCF
formula: C17H19NO4
InChI: InChI=1/C17H19NO4/c1-11-7-5-8-12(2)15(11)18(13(3)17(20)21-4)16(19)14-9-6-10-22-14/h5-10,13H,1-4H3
41 atoms
O  -3.840164 0.562908 -0.154033
O  1.742347 -1.588793 -0.493436
O  -1.579427 -1.527001 0.707115
O  -2.426097 -0.044081 -1.768699
N  -0.348504 0.27437 0.129938
C  -1.552297 1.099744 0.16289
C  0.907341 0.945409 0.135567
C  1.345229 1.564534 -1.040874
C  1.667555 0.993139 1.309563
C  -1.974512 1.49857 1.570089
C  -0.507659 -1.059775 0.369887
C  -2.635554 0.441882 -0.693016
C  2.545845 2.262401 -1.014547
C  2.868763 1.695407 1.288663
C  0.565541 1.46429 -2.317802
C  1.267182 0.274737 2.566424
C  3.303801 2.332987 0.141701
C  0.637881 -1.962175 0.184124
C  0.759862 -3.254413 0.589886
C  2.030846 -3.693489 0.136213
C  2.573863 -2.636246 -0.517796
C  -4.91883 -0.013692 -0.876993
H  -1.29539 2.018873 -0.374361
H  -2.809547 2.196368 1.54121
H  -2.269042 0.637172 2.165002
H  -1.146353 2.006968 2.064071
H  2.896802 2.743509 -1.919283
H  3.467296 1.74238 2.190261
H  1.211001 1.660252 -3.173208
H  0.112623 0.483805 -2.446443
H  -0.24727 2.193167 -2.361703
H  0.192621 0.270041 2.735738
H  1.590829 -0.76806 2.543754
H  1.734322 0.735633 3.435732
H  4.238187 2.878907 0.146073
H  0.022897 -3.812822 1.141599
H  2.478435 -4.663517 0.271548
H  3.510146 -2.494339 -1.031564
H  -5.807105 0.156491 -0.274727
H  -4.772225 -1.084603 -1.01611
H  -5.045632 0.45352 -1.854037
totalener: -1014.99208485 hartree
nucrepener: 1923.54353248 hartree
electener: -2938.53561733 hartree
oneelecener: -5204.79574198 hartree
twoeener: 2266.26012465 hartree
kineticenergy: 1010.73106886 hartree
xcener: -97.175517143724 hartree
chargesum: 0.0000000
charge: -0.265762 -0.237962 -0.397302 -0.365826 0.043731 0.101103 0.051574 -0.125949 -0.134477 -0.325886 0.325412 0.373440 -0.065825 -0.064353 -0.241379 -0.277603 -0.141829 0.145380 -0.228998 -0.130718 -0.032901 -0.136762 0.093610 0.102136 0.115283 0.097716 0.105890 0.103867 0.088048 0.120563 0.083564 0.115164 0.113816 0.094797 0.124620 0.152290 0.142121 0.141673 0.112241 0.119551 0.105938
qa: -0.2658 -0.2380 -0.3973 -0.3658 0.0437 0.1011 0.0516 -0.1259 -0.1345 -0.3259 0.3254 0.3734 -0.0658 -0.0644 -0.2414 -0.2776 -0.1418 0.1454 -0.2290 -0.1307 -0.0329 -0.1368 0.0936 0.1021 0.1153 0.0977 0.1059 0.1039 0.0880 0.1206 0.0836 0.1152 0.1138 0.0948 0.1246 0.1523 0.1421 0.1417 0.1122 0.1196 0.1059
va: 2.1412 2.3140 2.1115 2.1315 2.9613 3.7903 3.6537 3.8919 3.8964 3.9534 4.1469 4.1306 3.8909 3.9022 3.9356 3.9402 4.0064 3.4725 4.0476 3.9241 3.9541 3.9088 1.0022 1.0194 1.0124 0.9907 1.0107 1.0109 1.0047 1.0160 0.9996 0.9944 0.9898 1.0042 1.0004 1.0181 1.0041 1.0023 0.9950 0.9944 0.9936
dispcorr: -0.023664307 hartree
energy: -1015.015749158257
dipole: -2.04245 2.71299 0.67054 7.26781 -6.82977 0.43804 3.39207 -3.08289 0.30918
magnitude: 0.85855 au
magnitude: 2.18225 debye
