program: Orca
programVersion: 4.2.1
elementType: O N N N C C C C C C C C C C C H H H H H H H H H H H H H H H H H H H
charge: 0
multiplicity: 1
keywords: wb97x-d3
keywords: def2-TZVPP
keywords: def2/J RIJCOSX GRIDX6 NOFINALGRIDX
keywords: grid4 nofinalgrid
keywords: scfconv7
keywords: smallprint printgap noloewdin
keywords: NOSOSCF
formula: C11H19N3O
InChI: InChI=1/C11H19N3O/c1-4-6-7-9-8(3)13-11(12-5-2)14-10(9)15/h12,14H,4-7H2,1-3H3
34 atoms
O  0.611673 2.473142 0.271299
N  -1.162391 1.09653 0.075407
N  -1.050426 -1.196603 0.442946
N  -3.035166 -0.236021 -0.172163
C  2.4095 0.322784 0.904971
C  3.230937 0.588869 -0.363853
C  0.939405 0.148218 0.650949
C  3.298681 -0.58155 -1.339761
C  0.267777 -1.052016 0.704857
C  0.186228 1.322743 0.330649
C  -1.73493 -0.126522 0.122263
C  4.188594 -1.723546 -0.868521
C  0.964345 -2.327966 1.07039
C  -3.922902 0.859147 -0.504386
C  -5.287049 0.328472 -0.892363
H  2.555735 1.165677 1.586372
H  2.811153 -0.546864 1.428196
H  2.818096 1.463721 -0.870541
H  4.248057 0.86702 -0.06827
H  2.288597 -0.951547 -1.543021
H  3.676708 -0.219026 -2.299705
H  -1.711715 1.915607 -0.152602
H  4.168976 -2.558698 -1.570776
H  3.886521 -2.114754 0.104643
H  5.227143 -1.39877 -0.775791
H  1.470606 -2.252166 2.033733
H  1.720734 -2.595395 0.33141
H  0.248781 -3.145448 1.126786
H  -3.420111 -1.16283 -0.078328
H  -4.024226 1.544337 0.343362
H  -3.511982 1.434153 -1.339404
H  -5.227729 -0.317316 -1.768939
H  -5.742851 -0.235897 -0.07773
H  -5.950192 1.158408 -1.131873
elementType: O N C H
totalener: -670.22837635 hartree
nucrepener: 1029.55998923 hartree
electener: -1699.78836558 hartree
oneelecener: -2951.80711167 hartree
twoeener: 1252.01874609 hartree
cpcmener: -0.02918520 hartree
kineticenergy: 667.15902828 hartree
xcener: -66.030904489005 hartree
chargesum: -0.0000000
charge: -0.540756 -0.121007 -0.430848 -0.188941 -0.144345 -0.115235 -0.199085 -0.140360 0.199018 0.304990 0.390082 -0.277293 -0.307660 -0.036051 -0.274105 0.088051 0.088365 0.080653 0.071427 0.069841 0.076197 0.172524 0.095381 0.073090 0.085388 0.111474 0.113633 0.100538 0.164386 0.110487 0.101366 0.095316 0.091753 0.091724
qa: -0.5408 -0.1210 -0.4308 -0.1889 -0.1443 -0.1152 -0.1991 -0.1404 0.1990 0.3050 0.3901 -0.2773 -0.3077 -0.0361 -0.2741 0.0881 0.0884 0.0807 0.0714 0.0698 0.0762 0.1725 0.0954 0.0731 0.0854 0.1115 0.1136 0.1005 0.1644 0.1105 0.1014 0.0953 0.0918 0.0917
va: 1.9843 3.2576 3.0208 3.1741 3.8544 3.8302 3.5138 3.8914 3.8340 4.3238 4.1929 3.9173 3.9187 3.8597 3.9559 1.0196 1.0047 1.0229 1.0099 0.9988 1.0083 1.0271 1.0031 0.9992 1.0027 0.9932 0.9893 1.0290 1.0288 0.9858 0.9854 1.0007 0.9991 1.0052
dispcorr: -0.013859092 hartree
energy: -670.242235446606
dipole: 5.47832 -7.94829 -2.46997 -7.41724 6.48010 -0.93714 -4.61313 4.17675 -0.43637
magnitude: 2.67758 au
magnitude: 6.80586 debye
