program: Orca
programVersion: 4.2.1
elementType: O N N N C C C C C C C C C C C H H H H H H H H H H H H H H H H H H H
charge: 0
multiplicity: 1
keywords: wb97x-d3
keywords: def2-TZVPP
keywords: def2/J RIJCOSX GRIDX6 NOFINALGRIDX
keywords: grid4 nofinalgrid
keywords: scfconv7
keywords: smallprint printgap noloewdin
keywords: NOSOSCF
formula: C11H19N3O
InChI: InChI=1/C11H19N3O/c1-4-6-7-9-8(3)13-11(12-5-2)14-10(9)15/h12,14H,4-7H2,1-3H3
34 atoms
O  0.557933 2.234226 -0.627356
N  -1.294725 0.990713 -0.287736
N  -1.250432 -1.313373 0.038483
N  -3.245143 -0.191673 0.090271
C  2.297177 -0.072961 -0.47952
C  2.996661 0.257199 0.841755
C  0.803081 -0.114614 -0.35108
C  4.518595 0.297359 0.743302
C  0.091731 -1.266071 -0.107556
C  0.083768 1.117767 -0.437613
C  -1.915098 -0.187708 -0.055103
C  5.154877 -1.049908 0.429448
C  0.7837 -2.59043 0.006415
C  -4.115944 0.953672 -0.079269
C  -5.548948 0.572692 0.228513
H  2.660544 -1.026577 -0.866295
H  2.579697 0.676193 -1.22456
H  2.634782 1.226059 1.196156
H  2.702628 -0.473578 1.602899
H  4.814944 1.0293 -0.014803
H  4.920461 0.666736 1.690793
H  -1.826991 1.849976 -0.346268
H  4.870037 -1.802768 1.16812
H  6.244102 -0.983445 0.435338
H  4.863341 -1.427189 -0.551926
H  0.076905 -3.367094 0.290213
H  1.582162 -2.56769 0.74919
H  1.240201 -2.880947 -0.941916
H  -3.660398 -1.101675 0.214531
H  -3.808618 1.760946 0.591655
H  -4.051264 1.338792 -1.101999
H  -5.901536 -0.221297 -0.431292
H  -5.659489 0.238837 1.260539
H  -6.197875 1.435184 0.084022
elementType: O N C H
totalener: -670.23017446 hartree
nucrepener: 1011.53225771 hartree
electener: -1681.76243217 hartree
oneelecener: -2915.78642337 hartree
twoeener: 1234.02399120 hartree
cpcmener: -0.02965780 hartree
kineticenergy: 667.16001446 hartree
xcener: -66.029107952835 hartree
chargesum: -0.0000000
charge: -0.540840 -0.121730 -0.431672 -0.189806 -0.119083 -0.130740 -0.205464 -0.102999 0.187149 0.302000 0.390368 -0.279687 -0.284668 -0.035792 -0.274277 0.087309 0.083403 0.083167 0.069386 0.056120 0.068814 0.172757 0.079180 0.094311 0.077550 0.097718 0.103111 0.109241 0.164491 0.100845 0.111216 0.091214 0.095841 0.091564
qa: -0.5408 -0.1217 -0.4317 -0.1898 -0.1191 -0.1307 -0.2055 -0.1030 0.1871 0.3020 0.3904 -0.2797 -0.2847 -0.0358 -0.2743 0.0873 0.0834 0.0832 0.0694 0.0561 0.0688 0.1728 0.0792 0.0943 0.0776 0.0977 0.1031 0.1092 0.1645 0.1008 0.1112 0.0912 0.0958 0.0916
va: 1.9847 3.2587 3.0225 3.1742 3.8162 3.8495 3.5216 3.8808 3.8963 4.3373 4.1928 3.9267 3.9300 3.8610 3.9567 1.0044 1.0227 1.0214 1.0099 1.0082 1.0071 1.0269 1.0006 1.0043 0.9996 1.0259 0.9953 0.9951 1.0285 0.9847 0.9867 0.9990 1.0006 1.0053
dispcorr: -0.012943534 hartree
energy: -670.243117995136
dipole: 7.74608 -10.26703 -2.52094 -5.06824 4.29110 -0.77714 3.52060 -3.21689 0.30371
magnitude: 2.65544 au
magnitude: 6.74959 debye
