program: Orca
programVersion: 4.2.1
elementType: O N N N C C C C C C C C C C C H H H H H H H H H H H H H H H H H H H
charge: 0
multiplicity: 1
keywords: wb97x-d3
keywords: def2-TZVPP
keywords: def2/J RIJCOSX GRIDX6 NOFINALGRIDX
keywords: grid4 nofinalgrid
keywords: scfconv7
keywords: smallprint printgap noloewdin
keywords: NOSOSCF
formula: C11H19N3O
InChI: InChI=1/C11H19N3O/c1-4-6-7-9-8(3)13-11(12-5-2)14-10(9)15/h12,14H,4-7H2,1-3H3
34 atoms
O  0.610876 2.148984 0.983074
N  -1.215774 0.917479 0.505202
N  -1.206389 -1.403621 0.4039
N  -3.162086 -0.263249 0.055877
C  2.314489 -0.166523 1.136291
C  3.150955 0.320108 -0.052376
C  0.838589 -0.21497 0.867017
C  3.099116 -0.591001 -1.271384
C  0.118698 -1.370992 0.67364
C  0.137283 1.030548 0.801491
C  -1.844994 -0.263894 0.317084
C  3.880249 -0.031811 -2.451359
C  0.768779 -2.719393 0.749866
C  -3.942792 0.885934 -0.358578
C  -3.705394 1.302866 -1.80142
H  2.503247 0.497299 1.984268
H  2.673346 -1.150306 1.445001
H  2.827882 1.325691 -0.334333
H  4.190602 0.418218 0.276331
H  3.495968 -1.576546 -1.007376
H  2.059081 -0.749408 -1.571895
H  -1.731165 1.787439 0.462969
H  4.93355 0.112766 -2.202263
H  3.483144 0.935306 -2.766958
H  3.836887 -0.699801 -3.313212
H  1.587998 -2.811502 0.036207
H  0.043767 -3.5017 0.537256
H  1.186933 -2.905983 1.740573
H  -3.534434 -1.173062 -0.168517
H  -4.988625 0.61847 -0.216388
H  -3.762998 1.722253 0.320908
H  -2.673631 1.609691 -1.977591
H  -3.935103 0.485398 -2.485675
H  -4.348358 2.14537 -2.058446
elementType: O N C H
totalener: -670.22879439 hartree
nucrepener: 1035.27768859 hartree
electener: -1705.50648299 hartree
oneelecener: -2963.27419792 hartree
twoeener: 1257.76771493 hartree
cpcmener: -0.02953849 hartree
kineticenergy: 667.16281241 hartree
xcener: -66.029412833534 hartree
chargesum: 0.0000000
charge: -0.539484 -0.119303 -0.425648 -0.214128 -0.129344 -0.120368 -0.206063 -0.095228 0.198568 0.304889 0.380855 -0.289538 -0.289359 -0.017880 -0.241098 0.089814 0.087190 0.064843 0.075775 0.055828 0.066082 0.174269 0.078968 0.079973 0.090385 0.112638 0.097162 0.108081 0.173215 0.102456 0.085765 0.082321 0.086356 0.092006
qa: -0.5395 -0.1193 -0.4256 -0.2141 -0.1293 -0.1204 -0.2061 -0.0952 0.1986 0.3049 0.3809 -0.2895 -0.2894 -0.0179 -0.2411 0.0898 0.0872 0.0648 0.0758 0.0558 0.0661 0.1743 0.0790 0.0800 0.0904 0.1126 0.0972 0.1081 0.1732 0.1025 0.0858 0.0823 0.0864 0.0920
va: 1.9884 3.2509 3.0218 3.1852 3.8562 3.8346 3.5043 3.8613 3.8454 4.3242 4.2029 3.9615 3.9223 3.9051 3.9208 1.0167 1.0094 1.0218 1.0101 1.0032 1.0001 1.0246 1.0004 1.0004 1.0028 0.9923 1.0262 0.9948 1.0202 0.9957 0.9974 1.0067 1.0045 1.0090
dispcorr: -0.013880280 hartree
energy: -670.242674674816
dipole: 7.57167 -9.90738 -2.33571 -2.62617 1.84374 -0.78243 -10.67997 9.84793 -0.83204
magnitude: 2.60000 au
magnitude: 6.60868 debye
