program: Orca
programVersion: 4.2.1
elementType: O N N N C C C C C C C C C C C H H H H H H H H H H H H H H H H H H H
charge: 0
multiplicity: 1
keywords: wb97x-d3
keywords: def2-TZVPP
keywords: def2/J RIJCOSX GRIDX6 NOFINALGRIDX
keywords: grid4 nofinalgrid
keywords: scfconv7
keywords: smallprint printgap noloewdin
keywords: NOSOSCF
formula: C11H19N3O
InChI: InChI=1/C11H19N3O/c1-4-6-7-9-8(3)13-11(12-5-2)14-10(9)15/h12,14H,4-7H2,1-3H3
34 atoms
O  0.684764 1.926655 -1.129055
N  -1.172868 0.809059 -0.519489
N  -1.243862 -1.490542 -0.197173
N  -3.142513 -0.248329 0.096529
C  2.301243 -0.481835 -1.122531
C  3.185109 -0.535947 0.127445
C  0.828599 -0.431987 -0.831428
C  3.015946 0.648263 1.069975
C  0.071916 -1.534461 -0.508524
C  0.177197 0.844079 -0.851977
C  -1.838105 -0.324246 -0.202265
C  3.945058 0.571676 2.272223
C  0.665268 -2.907505 -0.446172
C  -3.903325 0.964152 0.316705
C  -3.650562 1.617064 1.666495
H  2.532717 -1.346156 -1.750093
H  2.577669 0.393616 -1.713613
H  2.987386 -1.462797 0.67656
H  4.230718 -0.595158 -0.19269
H  3.195064 1.578996 0.524483
H  1.980717 0.695723 1.419765
H  -1.651962 1.700099 -0.541908
H  3.795739 1.415315 2.94819
H  4.994211 0.577615 1.969017
H  3.776504 -0.341142 2.84788
H  1.453186 -3.061599 -1.181548
H  -0.106221 -3.659472 -0.603138
H  1.101662 -3.092867 0.537956
H  -3.55367 -1.120684 0.389039
H  -3.71936 1.671787 -0.495336
H  -4.953494 0.690729 0.22953
H  -2.613751 1.934391 1.785312
H  -4.279347 2.501238 1.776769
H  -3.888148 0.932857 2.481554
elementType: O N C H
totalener: -670.22879696 hartree
nucrepener: 1036.45722152 hartree
electener: -1706.68601848 hartree
oneelecener: -2965.69936275 hartree
twoeener: 1259.01334427 hartree
cpcmener: -0.02938970 hartree
kineticenergy: 667.16333109 hartree
xcener: -66.030165688823 hartree
chargesum: -0.0000000
charge: -0.531812 -0.117617 -0.435488 -0.209292 -0.134599 -0.143897 -0.192971 -0.066996 0.206646 0.294676 0.381232 -0.282948 -0.305996 -0.021126 -0.241378 0.099912 0.086071 0.069413 0.072670 0.057272 0.054315 0.173006 0.090404 0.080062 0.076384 0.108161 0.100912 0.109475 0.173461 0.086750 0.102688 0.081841 0.092073 0.086697
qa: -0.5318 -0.1176 -0.4355 -0.2093 -0.1346 -0.1439 -0.1930 -0.0670 0.2066 0.2947 0.3812 -0.2829 -0.3060 -0.0211 -0.2414 0.0999 0.0861 0.0694 0.0727 0.0573 0.0543 0.1730 0.0904 0.0801 0.0764 0.1082 0.1009 0.1095 0.1735 0.0868 0.1027 0.0818 0.0921 0.0867
va: 1.9913 3.2407 3.0200 3.1863 3.8256 3.8843 3.5155 3.8335 3.8435 4.3067 4.2110 3.9524 3.9552 3.9000 3.9148 1.0053 1.0285 1.0040 1.0124 1.0144 1.0101 1.0254 1.0029 1.0007 1.0007 0.9994 1.0192 0.9952 1.0207 0.9974 0.9948 1.0071 1.0089 1.0049
dispcorr: -0.013891852 hartree
energy: -670.242688814067
dipole: 7.46903 -9.86031 -2.39127 -0.38637 -0.19446 -0.58084 10.20105 -9.30761 0.89344
magnitude: 2.61797 au
magnitude: 6.65436 debye
