program: Orca
programVersion: 4.2.1
elementType: O N N N C C C C C C C C C C C H H H H H H H H H H H H H H H H H H H
charge: 0
multiplicity: 1
keywords: wb97x-d3
keywords: def2-TZVPP
keywords: def2/J RIJCOSX GRIDX6 NOFINALGRIDX
keywords: grid4 nofinalgrid
keywords: scfconv7
keywords: smallprint printgap noloewdin
keywords: NOSOSCF
formula: C11H19N3O
InChI: InChI=1/C11H19N3O/c1-4-6-7-9-8(3)13-11(12-5-2)14-10(9)15/h12,14H,4-7H2,1-3H3
34 atoms
O  0.418262 2.099455 0.591837
N  -1.37062 0.892435 -0.068776
N  -1.340596 -1.42187 -0.294623
N  -3.241153 -0.260505 -0.813201
C  2.060566 -0.256681 0.917058
C  3.044087 -0.027996 -0.232277
C  0.627694 -0.265521 0.47457
C  4.497399 -0.044232 0.222488
C  -0.056923 -1.405827 0.128413
C  -0.048153 0.989207 0.356077
C  -1.971394 -0.277363 -0.383223
C  5.478363 0.148132 -0.923997
C  0.594376 -2.752604 0.212262
C  -4.150327 0.865146 -0.755478
C  -4.714717 1.128409 0.632855
H  2.204537 0.524793 1.667925
H  2.305953 -1.196822 1.416298
H  2.894183 -0.796434 -0.998387
H  2.820014 0.929476 -0.712408
H  4.651854 0.737992 0.972273
H  4.708256 -0.992831 0.726406
H  -1.863774 1.770119 -0.173038
H  5.320173 1.103368 -1.428805
H  5.372848 -0.639301 -1.673329
H  6.511983 0.130117 -0.574794
H  -0.065587 -3.521215 -0.183784
H  0.831698 -3.012822 1.245848
H  1.530575 -2.784849 -0.346208
H  -3.639993 -1.172744 -0.965392
H  -3.663445 1.759881 -1.150118
H  -4.960014 0.647097 -1.449737
H  -5.242371 0.251835 1.010659
H  -3.935956 1.388975 1.350993
H  -5.422552 1.957209 0.598853
elementType: O N C H
totalener: -670.23038797 hartree
nucrepener: 1013.90887032 hartree
electener: -1684.13925828 hartree
oneelecener: -2920.57959086 hartree
twoeener: 1236.44033258 hartree
cpcmener: -0.02981616 hartree
kineticenergy: 667.16495153 hartree
xcener: -66.028466201215 hartree
chargesum: -0.0000000
charge: -0.537714 -0.122187 -0.428466 -0.210968 -0.116359 -0.117102 -0.203764 -0.090190 0.191834 0.300672 0.385369 -0.278362 -0.283710 -0.020362 -0.241365 0.082218 0.086500 0.060567 0.073121 0.059594 0.056134 0.174559 0.077805 0.077709 0.090444 0.096986 0.108244 0.105532 0.173513 0.086079 0.102750 0.086786 0.082292 0.091840
qa: -0.5377 -0.1222 -0.4285 -0.2110 -0.1164 -0.1171 -0.2038 -0.0902 0.1918 0.3007 0.3854 -0.2784 -0.2837 -0.0204 -0.2414 0.0822 0.0865 0.0606 0.0731 0.0596 0.0561 0.1746 0.0778 0.0777 0.0904 0.0970 0.1082 0.1055 0.1735 0.0861 0.1028 0.0868 0.0823 0.0918
va: 1.9893 3.2509 3.0251 3.1868 3.8333 3.8260 3.5437 3.8662 3.8815 4.3319 4.1976 3.9462 3.9336 3.9022 3.9164 1.0232 1.0060 1.0113 1.0185 1.0070 1.0080 1.0245 1.0014 1.0003 1.0040 1.0248 0.9957 0.9946 1.0205 0.9978 0.9951 1.0050 1.0064 1.0092
dispcorr: -0.013000662 hartree
energy: -670.243388627560
dipole: 9.84934 -12.25683 -2.40749 -2.43377 1.65499 -0.77878 -0.63248 0.00967 -0.62281
magnitude: 2.60584 au
magnitude: 6.62351 debye
