program: Orca
programVersion: 4.2.1
elementType: O N N N C C C C C C C C C C C H H H H H H H H H H H H H H H H H H H
charge: 0
multiplicity: 1
keywords: wb97x-d3
keywords: def2-TZVPP
keywords: def2/J RIJCOSX GRIDX6 NOFINALGRIDX
keywords: grid4 nofinalgrid
keywords: scfconv7
keywords: smallprint printgap noloewdin
keywords: NOSOSCF
formula: C11H19N3O
InChI: InChI=1/C11H19N3O/c1-4-6-7-9-8(3)13-11(12-5-2)14-10(9)15/h12,14H,4-7H2,1-3H3
34 atoms
O  1.110519 2.019461 -1.581271
N  -0.938334 1.37079 -0.893234
N  -1.416023 -0.76841 -0.131101
N  -3.089752 0.806775 -0.249995
C  2.272037 -0.557755 -1.053453
C  3.223609 0.028498 -0.005489
C  0.82845 -0.220943 -0.821656
C  3.026032 -0.530612 1.396722
C  -0.112472 -1.094433 -0.349648
C  0.418351 1.125493 -1.135778
C  -1.795245 0.439721 -0.408976
C  3.970193 0.094376 2.413836
C  0.221778 -2.520818 -0.023239
C  -4.049052 -0.069251 0.39164
C  -3.927613 -0.112137 1.906908
H  2.405516 -1.641046 -1.092827
H  2.567048 -0.179114 -2.034962
H  4.252243 -0.165145 -0.325862
H  3.113438 1.115325 0.00959
H  1.991525 -0.370212 1.714253
H  3.176077 -1.615272 1.380459
H  -1.258195 2.294627 -1.146783
H  3.819865 1.173184 2.478558
H  5.013729 -0.073262 2.141826
H  3.819737 -0.319842 3.411179
H  0.591706 -3.053357 -0.900621
H  -0.664328 -3.03475 0.340021
H  0.996796 -2.585607 0.740591
H  -3.296396 1.790583 -0.233436
H  -5.042001 0.27178 0.095571
H  -3.918343 -1.066876 -0.022928
H  -4.071549 0.874458 2.349333
H  -4.680726 -0.777244 2.330276
H  -2.947449 -0.483148 2.201498
totalener: -670.20240177 hartree
nucrepener: 1034.55969628 hartree
electener: -1704.76209805 hartree
oneelecener: -2961.74660693 hartree
twoeener: 1256.98450889 hartree
kineticenergy: 667.20657146 hartree
xcener: -66.029838502753 hartree
chargesum: 0.0000000
charge: -0.403586 -0.139353 -0.404405 -0.233745 -0.109210 -0.113622 -0.181924 -0.102882 0.173522 0.262214 0.416230 -0.266630 -0.296915 0.012162 -0.247431 0.074656 0.096059 0.065741 0.080966 0.065324 0.046656 0.130523 0.076417 0.073207 0.082143 0.097766 0.103454 0.105391 0.116728 0.086447 0.086237 0.067007 0.082188 0.098665
qa: -0.4036 -0.1394 -0.4044 -0.2337 -0.1092 -0.1136 -0.1819 -0.1029 0.1735 0.2622 0.4162 -0.2666 -0.2969 0.0122 -0.2474 0.0747 0.0961 0.0657 0.0810 0.0653 0.0467 0.1305 0.0764 0.0732 0.0821 0.0978 0.1035 0.1054 0.1167 0.0864 0.0862 0.0670 0.0822 0.0987
va: 2.1339 3.2553 2.9938 3.1881 3.8662 3.8439 3.5382 3.8772 3.8330 4.3344 4.0826 3.9699 3.9070 3.8626 3.9125 1.0086 1.0164 1.0110 1.0201 0.9986 1.0025 1.0487 1.0032 1.0031 1.0045 0.9970 1.0246 0.9945 1.0425 0.9977 1.0254 1.0097 1.0107 1.0142
dispcorr: -0.013795333 hartree
energy: -670.216197101999
dipole: 5.80076 -7.44747 -1.64671 -7.58574 7.45787 -0.12786 12.73246 -12.14576 0.58671
magnitude: 1.75278 au
magnitude: 4.45521 debye
