program: Orca
programVersion: 4.2.1
elementType: O N N N C C C C C C C C C C C H H H H H H H H H H H H H H H H H H H
charge: 0
multiplicity: 1
keywords: wb97x-d3
keywords: def2-TZVPP
keywords: def2/J RIJCOSX GRIDX6 NOFINALGRIDX
keywords: grid4 nofinalgrid
keywords: scfconv7
keywords: smallprint printgap noloewdin
keywords: NOSOSCF
formula: C11H19N3O
InChI: InChI=1/C11H19N3O/c1-4-6-7-9-8(3)13-11(12-5-2)14-10(9)15/h12,14H,4-7H2,1-3H3
34 atoms
O  0.948024 2.400631 0.221543
N  -1.075763 1.521153 -0.258379
N  -1.565961 -0.741369 -0.080024
N  -3.174931 0.727303 -0.824684
C  2.053751 -0.170467 0.923379
C  3.024864 -0.286934 -0.252547
C  0.638038 0.054105 0.486903
C  4.466012 -0.50546 0.18785
C  -0.283968 -0.942294 0.330717
C  0.253626 1.405177 0.164949
C  -1.925544 0.470791 -0.367042
C  5.431348 -0.604499 -0.984267
C  0.05367 -2.374228 0.625169
C  -4.196713 -0.299707 -0.848384
C  -4.817928 -0.582631 0.510686
H  2.368119 0.660731 1.559163
H  2.122197 -1.068908 1.541747
H  2.712267 -1.109704 -0.904822
H  2.960939 0.622673 -0.855456
H  4.770011 0.315056 0.844466
H  4.52957 -1.415462 0.793098
H  -1.35856 2.451617 -0.530869
H  5.171423 -1.43521 -1.642694
H  6.457267 -0.759276 -0.649111
H  5.415273 0.305921 -1.585368
H  0.970134 -2.68455 0.12305
H  -0.756795 -3.022851 0.302582
H  0.206004 -2.529648 1.695192
H  -3.49482 1.680088 -0.794855
H  -4.958458 0.022789 -1.560012
H  -3.747796 -1.205835 -1.251059
H  -5.292443 0.306536 0.928955
H  -5.582385 -1.355514 0.426078
H  -4.061618 -0.932708 1.211751
totalener: -670.20340982 hartree
nucrepener: 1014.67395428 hartree
electener: -1684.87736410 hartree
oneelecener: -2921.98135958 hartree
twoeener: 1237.10399548 hartree
kineticenergy: 667.20509749 hartree
xcener: -66.027662478338 hartree
chargesum: 0.0000000
charge: -0.402518 -0.139179 -0.407329 -0.233897 -0.104170 -0.110720 -0.164319 -0.091582 0.169962 0.254680 0.414905 -0.256382 -0.294486 0.011732 -0.247265 0.091844 0.072549 0.051100 0.082084 0.059508 0.049144 0.130103 0.069530 0.083416 0.075769 0.096623 0.102559 0.099048 0.116743 0.086548 0.086143 0.066768 0.082303 0.098789
qa: -0.4025 -0.1392 -0.4073 -0.2339 -0.1042 -0.1107 -0.1643 -0.0916 0.1700 0.2547 0.4149 -0.2564 -0.2945 0.0117 -0.2473 0.0918 0.0725 0.0511 0.0821 0.0595 0.0491 0.1301 0.0695 0.0834 0.0758 0.0966 0.1026 0.0990 0.1167 0.0865 0.0861 0.0668 0.0823 0.0988
va: 2.1357 3.2546 3.0002 3.1894 3.8497 3.8404 3.5749 3.8780 3.8657 4.3482 4.0848 3.9502 3.9214 3.8640 3.9124 1.0219 1.0063 1.0121 1.0198 1.0084 1.0083 1.0490 1.0028 1.0059 1.0039 0.9955 1.0235 0.9973 1.0425 0.9974 1.0258 1.0096 1.0107 1.0137
dispcorr: -0.012940979 hartree
energy: -670.216350799187
dipole: 8.00982 -9.70620 -1.69639 -10.60839 10.27933 -0.32906 -0.00894 -0.26570 -0.27464
magnitude: 1.74970 au
magnitude: 4.44737 debye
