program: Orca
programVersion: 4.2.1
elementType: O N N N C C C C C C C C C C C H H H H H H H H H H H H H H H H H H H
charge: 0
multiplicity: 1
keywords: wb97x-d3
keywords: def2-TZVPP
keywords: def2/J RIJCOSX GRIDX6 NOFINALGRIDX
keywords: grid4 nofinalgrid
keywords: scfconv7
keywords: smallprint printgap noloewdin
keywords: NOSOSCF
formula: C11H19N3O
InChI: InChI=1/C11H19N3O/c1-5-6-7-9-8(2)12-11(14(3)4)13-10(9)15/h13H,5-7H2,1-4H3
34 atoms
O  -0.551365 2.555499 0.364801
N  1.231491 1.226935 0.006199
N  1.196403 -1.077775 0.295581
N  3.133934 -0.016763 -0.396309
C  -2.270682 0.331892 0.985472
C  -3.148537 0.648826 -0.232739
C  -0.810353 0.210622 0.657841
C  -3.222734 -0.468258 -1.269688
C  -0.108327 -0.97385 0.628021
C  -0.098954 1.408042 0.349477
C  1.845469 0.017605 -0.025568
C  -4.099312 -1.638419 -0.845004
C  -0.766257 -2.273427 0.979559
C  3.889454 -1.252155 -0.412421
C  3.849884 1.195511 -0.741551
H  -2.628039 -0.580148 1.466204
H  -2.410704 1.125445 1.724138
H  -2.778174 1.560836 -0.704216
H  -4.159908 0.879921 0.116649
H  -3.615399 -0.058784 -2.204249
H  -2.213166 -0.821632 -1.503277
H  1.741599 2.068547 -0.227448
H  -5.135705 -1.321735 -0.712793
H  -3.773843 -2.080321 0.098252
H  -4.091918 -2.431944 -1.593457
H  -1.214251 -2.239444 1.973428
H  -0.044099 -3.085466 0.959898
H  -1.565474 -2.515836 0.278026
H  4.721334 -1.198548 0.290915
H  3.257693 -2.087675 -0.137271
H  4.292967 -1.435271 -1.408569
H  3.918517 1.889939 0.098681
H  4.863696 0.93069 -1.025704
H  3.40037 1.710026 -1.593319
elementType: O N C H
totalener: -670.20519686 hartree
nucrepener: 1048.73133371 hartree
electener: -1718.93653057 hartree
oneelecener: -2990.28522386 hartree
twoeener: 1271.34869328 hartree
cpcmener: -0.03394119 hartree
kineticenergy: 667.15364504 hartree
xcener: -66.033916514907 hartree
chargesum: 0.0000000
charge: -0.588665 -0.121148 -0.445585 -0.128075 -0.150205 -0.115986 -0.194121 -0.141963 0.187202 0.322242 0.395272 -0.277920 -0.308130 -0.184806 -0.183649 0.090555 0.087329 0.080186 0.073007 0.077496 0.071612 0.176016 0.085873 0.073244 0.095547 0.113077 0.101721 0.113449 0.116984 0.113585 0.115250 0.123425 0.105965 0.121217
qa: -0.5887 -0.1211 -0.4456 -0.1281 -0.1502 -0.1160 -0.1941 -0.1420 0.1872 0.3222 0.3953 -0.2779 -0.3081 -0.1848 -0.1836 0.0906 0.0873 0.0802 0.0730 0.0775 0.0716 0.1760 0.0859 0.0732 0.0955 0.1131 0.1017 0.1134 0.1170 0.1136 0.1153 0.1234 0.1060 0.1212
va: 1.9236 3.2666 3.0116 3.1956 3.8573 3.8238 3.5051 3.8890 3.8393 4.3051 4.0927 3.9179 3.9235 3.8650 3.8810 1.0050 1.0195 1.0235 1.0100 1.0078 0.9980 1.0262 1.0022 0.9998 1.0031 0.9925 1.0250 0.9893 0.9860 1.0276 0.9868 0.9869 0.9994 0.9873
dispcorr: -0.014372992 hartree
energy: -670.219569854364
dipole: -7.14443 9.75601 2.61157 -9.00397 7.89101 -1.11296 -3.95276 3.28801 -0.66475
magnitude: 2.91563 au
magnitude: 7.41094 debye
