program: Orca
programVersion: 4.2.1
elementType: O N N N C C C C C C C C C C C H H H H H H H H H H H H H H H H H H H
charge: 0
multiplicity: 1
keywords: wb97x-d3
keywords: def2-TZVPP
keywords: def2/J RIJCOSX GRIDX6 NOFINALGRIDX
keywords: grid4 nofinalgrid
keywords: scfconv7
keywords: smallprint printgap noloewdin
keywords: NOSOSCF
formula: C11H19N3O
InChI: InChI=1/C11H19N3O/c1-5-6-7-9-8(2)12-11(14(3)4)13-10(9)15/h13H,5-7H2,1-4H3
34 atoms
O  -0.509319 2.294729 0.537603
N  1.368622 1.128638 0.084909
N  1.457878 -1.187661 0.040846
N  3.352864 0.041637 -0.433739
C  -2.074236 -0.107468 0.920077
C  -2.968257 0.006717 -0.315748
C  -0.614477 -0.083697 0.583872
C  -4.452955 -0.02519 0.020849
C  0.143574 -1.203756 0.376254
C  0.008242 1.201044 0.41868
C  2.042189 -0.03322 -0.097294
C  -5.340256 0.063612 -1.212255
C  -0.444355 -2.57794 0.512226
C  4.122714 -1.1609 -0.656422
C  4.019117 1.309205 -0.597035
H  -2.323061 -1.022111 1.464521
H  -2.300494 0.719821 1.596746
H  -2.73307 -0.805751 -1.011684
H  -2.730791 0.936268 -0.840053
H  -4.68226 -0.943658 0.570594
H  -4.686057 0.799008 0.701369
H  1.816204 2.025306 -0.029723
H  -5.151175 -0.766161 -1.8955
H  -5.159621 0.987946 -1.763238
H  -6.398158 0.038602 -0.949497
H  -0.734131 -2.781299 1.544747
H  0.282694 -3.327356 0.210341
H  -1.339279 -2.695236 -0.099657
H  4.520257 -1.182702 -1.673302
H  4.958727 -1.222428 0.043526
H  3.485531 -2.026435 -0.513375
H  5.053321 1.12658 -0.876816
H  3.578076 1.918103 -1.392315
H  4.03869 1.897644 0.325421
totalener: -670.19002561 hartree
nucrepener: 1024.37735213 hartree
electener: -1694.56737774 hartree
oneelecener: -2941.20687685 hartree
twoeener: 1246.63949911 hartree
kineticenergy: 667.18829608 hartree
xcener: -66.028600632541 hartree
chargesum: 0.0000000
charge: -0.410840 -0.154864 -0.409102 -0.146950 -0.104696 -0.111150 -0.177495 -0.092138 0.179382 0.264398 0.389240 -0.256423 -0.299407 -0.186716 -0.209420 0.071558 0.091411 0.049594 0.082332 0.048419 0.060408 0.147175 0.069300 0.075110 0.083663 0.097751 0.102076 0.096524 0.099593 0.101102 0.126232 0.095876 0.113068 0.114987
qa: -0.4108 -0.1549 -0.4091 -0.1470 -0.1047 -0.1111 -0.1775 -0.0921 0.1794 0.2644 0.3892 -0.2564 -0.2994 -0.1867 -0.2094 0.0716 0.0914 0.0496 0.0823 0.0484 0.0604 0.1472 0.0693 0.0751 0.0837 0.0978 0.1021 0.0965 0.0996 0.1011 0.1262 0.0959 0.1131 0.1150
va: 2.1243 3.2476 3.0301 3.1363 3.8491 3.8407 3.5997 3.8781 3.8552 4.3312 4.0745 3.9495 3.9284 3.8723 3.9017 1.0067 1.0231 1.0119 1.0191 1.0084 1.0084 1.0460 1.0027 1.0042 1.0056 0.9979 1.0225 0.9954 0.9871 0.9869 1.0337 1.0047 0.9853 0.9850
dispcorr: -0.013016580 hartree
energy: -670.203042187877
dipole: -9.91839 11.72576 1.80737 -5.79049 5.28314 -0.50736 -4.22126 3.78179 -0.43947
magnitude: 1.92799 au
magnitude: 4.90056 debye
