program: Orca
programVersion: 4.2.1
elementType: S O O O N N N N C C C C C C C C C C C C C H H H H H H H H H H H H H H H H H H H H H H H H
charge: 0
multiplicity: 1
keywords: wb97x-d3
keywords: def2-TZVPP
keywords: def2/J RIJCOSX GRIDX6 NOFINALGRIDX
keywords: grid4 nofinalgrid
keywords: scfconv7
keywords: smallprint printgap noloewdin
keywords: NOSOSCF
formula: C13H24N4O3S
InChI: InChI=1/C13H24N4O3S/c1-6-8-9-11-10(3)15-13(14-7-2)16-12(11)20-21(18,19)17(4)5/h14H,6-9H2,1-5H3
45 atoms
S  -1.54766 -1.509686 0.003907
O  -0.265621 -0.868302 0.807222
O  -1.58148 -2.837276 0.566426
O  -1.34561 -1.315166 -1.410789
N  1.888395 2.335463 -0.372384
N  -0.176093 1.200593 -0.175324
N  -2.89033 -0.73686 0.486037
N  -0.021695 3.265093 -1.200512
C  2.571801 -1.086846 1.060327
C  3.282094 -1.885925 -0.040521
C  1.847844 0.120798 0.535153
C  2.348068 -2.590095 -1.019366
C  2.514905 1.299508 0.163979
C  0.475294 0.189794 0.344738
C  1.639928 -3.795078 -0.418412
C  0.568941 2.238785 -0.559926
C  3.990849 1.448581 0.345589
C  -1.45045 3.467511 -1.277857
C  -3.316234 0.483825 -0.187393
C  -3.167311 -0.745628 1.920864
C  -2.062183 4.022948 -0.002531
H  1.887392 -1.737055 1.605418
H  3.31584 -0.770282 1.794772
H  3.928265 -2.629812 0.435273
H  3.950337 -1.220759 -0.592873
H  1.614207 -1.881066 -1.414382
H  2.930361 -2.919041 -1.883708
H  1.063575 -3.537509 0.469349
H  0.949543 -4.246552 -1.131766
H  2.361117 -4.561589 -0.128242
H  4.341061 1.006625 1.277231
H  4.269793 2.499582 0.331662
H  4.530438 0.955611 -0.465479
H  0.561693 4.075131 -1.334385
H  -1.631406 4.155788 -2.102606
H  -1.925759 2.52819 -1.554341
H  -2.858175 1.368828 0.249598
H  -4.396573 0.552542 -0.07514
H  -3.094265 0.44615 -1.248225
H  -2.613844 0.034338 2.44722
H  -4.231363 -0.564509 2.054138
H  -2.940578 -1.709974 2.365211
H  -3.141209 4.133813 -0.116641
H  -1.64969 5.004373 0.234714
H  -1.88004 3.367176 0.84971
elementType: S O N C H
totalener: -1352.85118461 hartree
nucrepener: 2117.80719500 hartree
electener: -3470.65837961 hartree
oneelecener: -6060.60614024 hartree
twoeener: 2589.94776063 hartree
cpcmener: -0.03085655 hartree
kineticenergy: 1347.71120557 hartree
xcener: -110.805905595383 hartree
chargesum: -0.0000000
charge: 0.929966 -0.307793 -0.511322 -0.498700 -0.397410 -0.372743 -0.152233 -0.214598 -0.138713 -0.143622 -0.153326 -0.109291 0.171782 0.323984 -0.283677 0.381594 -0.298699 -0.014098 -0.198043 -0.177551 -0.285041 0.095448 0.110039 0.075401 0.092153 0.052503 0.079614 0.066484 0.092977 0.090367 0.111362 0.100778 0.113256 0.165538 0.107446 0.091676 0.107989 0.132649 0.127508 0.115582 0.116824 0.123982 0.097489 0.097506 0.084963
qa: 0.9300 -0.3078 -0.5113 -0.4987 -0.3974 -0.3727 -0.1522 -0.2146 -0.1387 -0.1436 -0.1533 -0.1093 0.1718 0.3240 -0.2837 0.3816 -0.2987 -0.0141 -0.1980 -0.1776 -0.2850 0.0954 0.1100 0.0754 0.0922 0.0525 0.0796 0.0665 0.0930 0.0904 0.1114 0.1008 0.1133 0.1655 0.1074 0.0917 0.1080 0.1326 0.1275 0.1156 0.1168 0.1240 0.0975 0.0975 0.0850
va: 6.0038 2.0485 1.9879 1.9770 3.0371 2.9609 3.0773 3.1491 3.8215 3.8709 3.6675 3.8532 3.9008 4.0338 3.9205 4.2053 3.9539 3.8696 3.9118 3.8927 3.9050 1.0140 1.0049 1.0117 1.0074 1.0209 1.0073 1.0127 1.0053 1.0042 0.9992 1.0202 0.9962 1.0227 0.9999 1.0035 0.9847 0.9977 1.0060 0.9936 0.9928 1.0098 1.0054 1.0052 1.0008
dispcorr: -0.025706183 hartree
energy: -1352.876890792887
dipole: 5.07957 -5.53976 -0.46019 4.17993 -1.65727 2.52266 2.33600 -1.28789 1.04811
magnitude: 2.77022 au
magnitude: 7.04135 debye
